program: Gaussian 09
title: 000242168
version: EM64L-G09RevD.01
frameworkgroup: C1[X(C9H11N3O5S)]
method: RPBEPBE
basis: SDD
operation: Freq
keyword: #p
keyword: freq=noraman
keyword: PBEPBE/SDD
title: #p freq=noraman PBEPBE/SDD
converged: YES YES NO NO
title: Mulliken charges:
elementType: S O O O O O N N N C C C C C C C C C H H H H H H H H H H H
charge: 0.453521 -0.239497 -0.235470 -0.252297 -0.215551 -0.213406 -0.139481 -0.046023 0.089580 -0.025036 -0.700426 -0.098961 0.311310 -0.821357 -0.099311 -0.250929 0.328990 -0.753753 0.272974 0.235207 0.215182 0.294800 0.275185 0.303779 0.237087 0.301596 0.256735 0.263236 0.252316
chargesum: 0.00000
title: Mulliken charges with hydrogens summed into heavy atoms:
elementType: S O O O O O N N N C C C C C C C C C
charge: 0.453521 -0.239497 -0.235470 -0.252297 -0.215551 -0.213406 -0.139481 -0.046023 0.089580 0.247938 0.044763 -0.098961 0.311310 -0.005305 -0.099311 0.050667 0.328990 0.018533
polarizability: 2.28921331e+02 2.05255635e+01 1.58632275e+02 1.17523379e+01 -1.70241286e+01 1.11331238e+02
1716.lowfreq: -49.4662 -2.9264 -0.0025 -0.0017 -0.0004 2.0082 4.9667 25.9789 43.9438
frequency: -49.4616 25.9569 43.9359 55.6582 74.3213 86.3968 98.6316 115.4747 130.1834 180.0315 188.7109 194.4508 219.1554 230.2473 259.7418 277.5285 293.1987 326.6462 350.2325 372.2036 414.5136 459.0365 462.5565 486.6845 509.4006 540.3905 575.3232 585.0067 589.0919 615.0755 632.8014 652.3378 680.4680 698.7578 736.6196 793.0001 852.5761 887.7907 894.4841 974.6441 995.2625 1014.7227 1039.8953 1047.6961 1051.2503 1059.1369 1083.9244 1142.6994 1170.3811 1188.7056 1212.1716 1247.8548 1265.8114 1295.4110 1310.7147 1344.3258 1376.4761 1387.9494 1392.0126 1399.5819 1453.0676 1454.0659 1456.5863 1460.6940 1468.7305 1480.4513 1486.3049 1494.1400 1603.0499 1645.4419 2990.0280 3008.0180 3010.9815 3079.3552 3097.9287 3099.7900 3101.1479 3132.5207 3146.3652 3146.9893 3215.2841
redmass: 1.0506 8.3443 7.3090 6.9493 6.7666 5.5284 5.9108 8.4556 4.8290 5.4513 1.9309 5.8950 5.1031 1.4566 1.0835 4.3769 6.2089 6.4593 6.0625 6.4142 6.0158 4.6782 8.3282 3.9140 4.0015 4.2020 3.6198 4.9931 5.0020 5.3945 5.9217 6.6983 10.7178 6.6946 11.6361 3.4997 3.2026 6.4318 1.4373 3.9533 1.9711 1.9329 2.1444 1.6353 1.9010 7.3381 1.7105 2.5005 2.9916 3.0278 7.6926 3.5450 3.2121 3.6015 1.4421 12.2668 1.3838 1.2157 1.2532 1.3789 1.3563 1.0877 1.0655 1.6705 1.1273 1.0570 1.5473 2.4510 7.8831 10.4943 1.0382 1.0378 1.0370 1.0985 1.0969 1.0981 1.0862 1.0980 1.1012 1.0987 1.0967
irintensity: 1.5144 0.5718 0.4415 1.9351 1.3494 1.7046 0.0943 0.9064 6.2530 1.1284 6.6494 1.9498 11.6829 6.2963 0.2973 0.7707 1.8734 2.2144 2.6372 3.6723 7.9184 22.3222 1.4965 10.2631 1.4922 12.6857 1.2177 5.2049 12.6670 4.5127 34.5241 16.1168 11.9364 3.8096 20.7977 10.1463 23.3673 147.7679 23.0723 17.1987 53.9010 38.4692 27.4603 12.8084 40.5788 7.8343 98.0675 144.3476 328.4416 190.7590 400.8868 134.3507 87.8028 218.2699 23.5961 99.7410 80.3928 64.9573 24.5162 10.6699 123.0518 35.2490 4.5713 145.9658 32.7708 41.9084 49.5806 23.1747 129.0302 176.2540 9.0419 17.2802 0.6173 6.3719 3.1948 18.2506 9.4614 4.1347 4.4502 1.4339 2.3846
temp: 298.150 k
press: 1.00000 atm
elementType: 16 8 8 8 8 8 7 7 7 6 6 6 6 6 6 6 6 6 1 1 1 1 1 1 1 1 1 1 1
symmnumber: 1
zpe: 536047.8 jmol-1
zpe.correction: 0.204170 hartree
zpe.thermalcorrener: 0.221903 hartree
zpe.thermalcorrenthalpy: 0.222847 hartree
zpe.thermalcorrgfe: 0.157247 hartree
zpe.sumelectzpe: -1286.552491 hartree
zpe.sumelectthermal: -1286.534758 hartree
zpe.sumelectthermalent: -1286.533814 hartree
zpe.sumelectthermalfe: -1286.599414 hartree
dipole: 8.0319 -1.6758 2.6479
dipole: 8.6215
quadrupole: -133.9414 -110.3837 -107.6691
quadrupole: -1.4859 -0.1736 8.6240
quadrupole: -16.6100 6.9477 9.6623 -1.4859 -0.1736 8.6240
hfenergy: -1286.756661 hartree
pointgroup: C01 [X(C9H11N3O5S1)]
dipole: 3.1378301 0.3552689 -1.2382546 debye
polarizability: 223.5724659|-27.4206481|160.6087491|-17.9759805|-16.963157|114.7036287 unknown
InChI: InChI=1S/C9H11N3O5S/c1-5(13)11(6(2)17-7(3)14)9-10-4-8(18-9)12(15)16/h4,6H,1-3H3
charge 0 multiplicity 1
29 atoms
S  -1.816265 -1.004141 0.521614
O  2.237198 1.137415 -0.462681
O  0.100459 -2.732007 0.671306
O  3.568881 -0.025729 1.065373
O  -4.686128 1.786994 0.066102
O  -4.657015 -0.237017 1.154666
N  0.843022 -0.868057 -0.506233
N  -0.671053 0.942687 -0.967675
N  -4.098505 0.694114 0.442839
C  1.959952 -0.136953 -1.182356
C  1.716249 0.214668 -2.647364
C  -0.414207 -0.246569 -0.40786
C  1.053568 -2.166535 0.066812
C  2.411212 -2.822766 -0.07858
C  -2.731588 0.49645 0.047658
C  -1.964149 1.36414 -0.716367
C  3.062158 1.051167 0.676388
C  3.229949 2.403948 1.322465
H  2.847859 -0.77591 -1.07068
H  2.638712 0.650642 -3.066604
H  1.470986 -0.698967 -3.217277
H  0.89476 0.936907 -2.743743
H  2.344003 -3.810342 0.400059
H  3.191662 -2.226308 0.427272
H  2.69836 -2.965183 -1.136213
H  -2.314762 2.317583 -1.111183
H  2.81965 2.369108 2.347024
H  2.716658 3.187136 0.747755
H  4.304374 2.63963 1.409979
