program: Gaussian 09
title: 000242163
version: EM64L-G09RevD.01
frameworkgroup: C1[X(C15H30O2)]
method: RPBEPBE
basis: SDD
operation: Freq
keyword: #pfreq=noraman
keyword: PBEPBE/SDD
title: #p freq=noraman PBEPBE/SDD
converged: YES YES NO NO
title: Mulliken charges:
elementType: O O C C C C C C C C C C C C C C C H H H H H H H H H H H H H H H H H H H H H H H H H H H H H H
charge: -0.312647 -0.260356 0.321766 -0.022513 0.372627 -0.407501 -0.110530 -0.750528 -0.757756 -0.458658 -0.737746 -0.715045 -0.730146 -0.362984 -0.349873 -0.359793 -0.698003 0.176623 0.186474 0.225242 0.226383 0.213861 0.262295 0.201466 0.214077 0.209988 0.234694 0.202603 0.199710 0.213617 0.235029 0.231824 0.208169 0.215565 0.210659 0.194663 0.209009 0.255398 0.213385 0.209359 0.182457 0.183441 0.196573 0.195297 0.208808 0.213880 0.209135
chargesum: 0.00000
title: Mulliken charges with hydrogens summed into heavy atoms:
elementType: O O C C C C C C C C C C C C C C C
charge: -0.312647 -0.260356 0.321766 0.154110 0.372627 0.004216 0.115854 -0.072906 -0.098997 -0.056345 -0.057275 -0.080652 -0.071077 0.059761 0.016024 0.032077 -0.066180
polarizability: 1.89237447e+02 -1.28597776e+00 1.57758886e+02 5.22910529e+00 3.10489032e-01 1.57521622e+02
1716.lowfreq: -7.8937 -4.6711 -0.0007 -0.0004 -0.0002 9.1789 30.2502 41.4242 57.9092
frequency: 30.2184 41.3833 57.5859 67.0613 81.6517 107.1684 118.2286 126.4288 145.6943 161.4961 176.9463 190.6649 206.9638 214.4244 228.5239 229.2960 238.4021 254.3260 274.6650 288.5518 297.1186 318.2015 330.3681 337.5705 375.8711 402.1878 414.7837 435.4529 449.7458 488.7417 505.3389 526.0138 554.9157 664.7609 717.1623 727.9780 753.0450 767.4222 794.2295 842.7710 853.4446 883.8441 896.4077 911.6369 916.9881 922.7353 929.5484 938.7591 953.7406 955.8967 973.8585 982.8050 1002.8462 1022.1701 1032.1524 1041.1634 1063.0873 1066.4292 1089.4752 1118.0121 1133.2831 1139.3414 1160.3693 1174.3237 1178.3984 1203.4540 1211.0206 1215.3484 1237.5554 1244.6902 1267.4095 1274.4952 1277.1352 1283.7477 1297.8368 1307.6571 1311.7176 1317.8730 1342.0609 1350.7287 1352.7505 1359.8454 1370.0733 1376.0976 1380.8872 1386.5511 1393.1669 1400.1437 1441.5766 1450.9063 1461.6257 1463.5590 1465.7867 1466.8786 1468.4265 1471.3753 1475.7157 1476.1205 1477.6269 1481.4297 1482.9181 1485.2193 1489.8162 1490.5471 1501.6838 2906.0071 2937.1768 2947.3564 2966.4223 2969.8677 2970.2188 2971.0085 2977.0834 2979.9847 2985.5710 2988.7997 2994.4351 2994.7182 2998.1983 3019.8826 3036.7135 3049.1631 3054.9776 3058.9184 3063.4484 3067.0197 3067.9200 3068.4113 3068.5093 3082.3469 3094.1063 3094.2395 3099.1354 3103.9754 3107.4490
redmass: 3.4286 3.2663 1.6248 2.5914 2.8331 2.6576 2.2834 1.8314 1.4486 1.4404 2.0708 1.9040 1.0641 1.2709 1.6755 1.1558 1.8438 1.9318 3.3017 2.7909 2.8109 2.0385 2.8346 2.3877 2.5574 2.3024 2.2806 3.3308 2.5403 3.3360 3.1061 3.4487 4.1650 4.2359 2.5309 1.1655 1.5438 3.1744 1.9962 1.9920 1.5237 1.9540 2.2371 1.9031 1.8292 1.2515 2.8715 1.4017 1.2824 1.6158 1.6665 1.7212 4.1030 1.6706 2.9536 1.3264 3.3568 2.2083 2.3956 2.2217 3.0089 2.4871 1.9856 2.4425 1.8699 1.6140 1.7376 2.0864 1.8546 1.6294 1.2535 1.3802 1.5268 1.0609 1.1514 1.4208 1.4341 1.4299 1.4043 1.5535 1.3980 1.6575 1.2061 1.2163 1.2027 1.2186 1.2185 1.2004 1.0836 1.0762 1.0508 1.0575 1.0648 1.0522 1.0549 1.0683 1.0523 1.0430 1.0510 1.0577 1.0679 1.0544 1.0707 1.0756 1.0506 1.0818 1.0665 1.0587 1.0577 1.0376 1.0386 1.0389 1.0373 1.0368 1.0586 1.0986 1.0815 1.0557 1.0403 1.1023 1.1008 1.0980 1.0966 1.0982 1.1029 1.0987 1.0989 1.0997 1.1008 1.0992 1.0988 1.0987 1.1001 1.0978 1.0946
irintensity: 0.0689 0.2286 0.0321 0.0773 0.4682 0.4167 1.0330 0.0847 0.1356 0.1634 0.2210 0.5248 0.0482 0.1395 1.5512 0.1118 0.8923 0.7235 1.7180 2.6421 4.7618 1.0710 2.2148 0.1735 0.6244 0.4538 0.5520 7.9089 1.0866 0.7894 0.0514 2.1822 7.6568 3.6241 6.1641 14.3161 2.1946 3.1715 15.3043 7.4178 14.4696 9.6235 10.5601 15.6609 3.1588 0.8716 38.9569 6.2900 1.5904 17.3140 4.2744 15.1245 8.4206 14.2257 77.3603 21.1620 37.3730 21.6675 47.5054 0.9220 26.5695 14.3463 33.5191 7.2966 6.5957 6.9518 7.1738 1.4497 36.1012 39.3073 1.6481 1.3484 2.0792 0.1126 4.0364 8.1047 1.6382 3.9819 1.4401 0.9998 3.7765 11.5522 18.0231 19.0835 31.6624 14.1241 15.8911 25.0366 4.7311 4.2631 6.7442 2.4305 0.7763 5.5331 10.1225 0.5064 8.3240 12.5971 6.3405 1.7762 2.4150 12.3772 22.4733 13.1183 21.8256 33.0395 69.7889 19.4598 55.7577 38.4420 32.7100 32.1919 40.0575 35.0351 4.7916 4.9184 17.5357 35.2560 50.2411 23.3148 0.0821 7.8703 41.4183 10.6167 0.3673 18.2482 23.8135 127.8375 156.5421 38.3549 3.5551 44.8134 26.7999 21.9243 30.6309
temp: 298.150 k
press: 1.00000 atm
elementType: 8 8 6 6 6 6 6 6 6 6 6 6 6 6 6 6 6 1 1 1 1 1 1 1 1 1 1 1 1 1 1 1 1 1 1 1 1 1 1 1 1 1 1 1 1 1 1
symmnumber: 1
zpe: 1107865.2 jmol-1
zpe.correction: 0.421964 hartree
zpe.thermalcorrener: 0.443306 hartree
zpe.thermalcorrenthalpy: 0.444250 hartree
zpe.thermalcorrgfe: 0.372740 hartree
zpe.sumelectzpe: -738.613725 hartree
zpe.sumelectthermal: -738.592383 hartree
zpe.sumelectthermalent: -738.591438 hartree
zpe.sumelectthermalfe: -738.662949 hartree
dipole: -2.0297 -0.2333 0.2382
dipole: 2.0569
quadrupole: -106.0630 -109.0633 -106.8849
quadrupole: 1.7534 1.6774 -1.7299
quadrupole: 1.2741 -1.7262 0.4521 1.7534 1.6774 -1.7299
hfenergy: -739.0356888 hartree
pointgroup: C01 [X(C15H30O2)]
dipole: 0.7972728 0.1055591 0.0899215 debye
polarizability: 189.2600983|-1.0228981|157.7053989|-5.214398|-0.3867117|157.5524583 unknown
InChI: InChI=1S/C15H30O2/c1-7-8-9-10-15(6)16-11-14(4,5)13(17-15)12(2)3/h12-13H,7-11H2,1-6H3
charge 0 multiplicity 1
47 atoms
O  0.458772 -0.219951 0.74993
O  -0.054156 1.880937 -0.318731
C  1.978662 0.554552 -1.068983
C  1.876871 -0.236349 0.284167
C  -0.167884 1.096314 0.926805
C  1.323003 1.950047 -0.81823
C  2.225213 -1.751033 0.322312
C  1.235759 -0.175403 -2.21201
C  3.447017 0.867446 -1.464727
C  -1.67034 0.829837 1.129349
C  0.446092 1.858346 2.121366
C  3.615293 -2.113631 -0.251696
C  2.118555 -2.265143 1.781107
C  -2.348626 0.073028 -0.031297
C  -3.846626 -0.191623 0.237844
C  -4.545338 -0.940346 -0.920139
C  -6.039273 -1.218789 -0.646451
H  2.517448 0.289476 1.03218
H  1.960557 2.538903 -0.121712
H  1.2455 2.504777 -1.769787
H  1.448801 -2.266545 -0.277509
H  1.6901 -1.159852 -2.425265
H  0.175591 -0.328903 -1.947811
H  1.277178 0.422667 -3.142102
H  3.466446 1.665016 -2.233196
H  4.036156 1.22352 -0.597594
H  3.963125 -0.00698 -1.889194
H  -2.164365 1.809619 1.278834
H  -1.78337 0.25606 2.069868
H  1.522981 2.058809 1.992255
H  -0.069555 2.82595 2.246461
H  0.318348 1.264191 3.042705
H  4.416617 -1.501367 0.203982
H  3.839061 -3.173072 -0.027307
H  3.667803 -1.991061 -1.346661
H  2.908773 -1.813179 2.413074
H  2.248426 -3.362739 1.815401
H  1.137969 -2.01234 2.215131
H  -2.231426 0.662706 -0.9603
H  -1.820944 -0.886828 -0.189617
H  -3.957434 -0.782471 1.172012
H  -4.369692 0.771969 0.416194
H  -4.442545 -0.345793 -1.850825
H  -4.016404 -1.897865 -1.104035
H  -6.166458 -1.837314 0.262339
H  -6.5143 -1.754674 -1.489088
H  -6.595788 -0.275324 -0.489053
