program: Gaussian 09
title: 000242040
version: EM64L-G09RevD.01
frameworkgroup: C1[X(C16H14O4)]
method: RPBEPBE
basis: SDD
operation: Freq
keyword: #pfreq=noraman
keyword: PBEPBE/SDD
title: #p freq=noraman PBEPBE/SDD
converged: YES YES NO NO
title: Mulliken charges:
elementType: O O O O C C C C C C C C C C C C C C C C H H H H H H H H H H H H H H
charge: -0.233016 -0.307413 -0.209390 -0.293593 -0.380520 0.312726 0.647967 0.068395 0.119397 -0.403498 -0.613477 -0.372340 -0.361329 0.232931 -0.208056 -0.329356 0.175448 -0.221913 -0.530084 -0.530276 0.260966 0.254010 0.256496 0.244209 0.270091 0.234429 0.253094 0.237234 0.253085 0.228919 0.231826 0.256062 0.223792 0.233182
chargesum: 0.00000
title: Mulliken charges with hydrogens summed into heavy atoms:
elementType: O O O O C C C C C C C C C C C C C C C C
charge: -0.233016 -0.307413 -0.209390 -0.293593 -0.119554 0.312726 0.647967 0.068395 0.119397 -0.149488 -0.356981 -0.128131 -0.091238 0.232931 0.026374 -0.076261 0.175448 0.015321 0.183746 0.182759
polarizability: 2.61501958e+02 1.06443704e+00 1.63285786e+02 2.04384272e+01 -2.14298449e+00 1.34411931e+02
1716.lowfreq: -5.1597 -3.2923 -0.0007 -0.0006 -0.0006 6.4551 17.4978 40.9993 47.7171
frequency: 17.3765 40.9856 47.7056 75.0569 109.1471 117.5242 134.2569 155.9692 161.4639 165.9464 189.6051 209.0797 218.1590 248.6578 283.0143 297.8470 353.1682 386.1328 411.5803 415.3540 468.1663 493.1700 508.5096 550.5940 562.4690 571.0983 598.5830 652.9719 667.5010 691.1717 708.5743 723.3815 744.2948 756.1834 785.3295 787.0295 834.0220 849.0676 865.3104 895.3274 903.8900 912.1190 947.5298 962.6423 966.4011 970.9323 982.4904 1002.9392 1018.9796 1086.1827 1095.5067 1113.8310 1115.8741 1144.3284 1154.0554 1157.2940 1169.3869 1181.1686 1195.7812 1206.9571 1244.1645 1252.6979 1272.0941 1281.2977 1286.2651 1373.2827 1402.1495 1405.9408 1425.6984 1446.1621 1450.4099 1458.2494 1460.3059 1461.0823 1476.6394 1487.6343 1487.9139 1575.0418 1605.6484 1613.6033 1619.3713 1699.1839 2974.7490 2976.6305 3014.3600 3071.5160 3074.1033 3123.9573 3125.6158 3134.2710 3140.1415 3143.0976 3146.4717 3157.7326 3166.7011 3171.3261
redmass: 4.8611 4.7889 5.6545 3.7493 3.1789 3.1360 5.0270 1.8365 1.7336 1.1570 4.2287 4.5562 5.4472 5.8536 6.4901 5.8173 4.5971 4.9607 5.3253 3.2253 4.3926 3.6133 6.6422 7.8054 5.7240 6.8293 5.9026 4.4351 4.7023 6.2385 5.4076 3.5184 5.7575 3.6351 3.8012 1.7494 1.8264 3.1411 4.0435 1.5483 2.3618 2.9849 7.7885 1.4538 3.2356 1.7035 3.8432 1.3322 2.0777 2.5487 2.3309 1.2408 1.2410 1.4330 1.3033 1.4774 1.1298 2.2163 1.7814 1.6313 2.2434 1.7656 1.8421 1.4804 2.4409 6.2854 6.0358 2.2473 1.1818 1.4174 2.4661 1.0581 1.1530 2.2061 1.0687 1.3579 1.7689 7.2668 7.5605 6.6462 7.2990 12.9784 1.0305 1.0310 1.0847 1.1046 1.1037 1.1028 1.1031 1.0862 1.0890 1.0915 1.0902 1.0955 1.0963 1.1004
irintensity: 0.5973 2.3804 0.1874 3.4671 8.9622 1.8848 0.9380 2.2669 1.2183 0.2335 0.8214 8.8166 2.9587 4.9686 2.7329 7.9008 0.2696 1.7831 11.9263 1.3861 4.0461 5.2031 4.6605 2.0192 8.4572 5.9600 25.0280 2.4279 24.0225 5.1172 3.6338 41.1815 2.1381 11.3304 19.2412 41.2563 42.1947 15.6610 116.3503 5.6355 2.5685 66.7602 52.8888 24.2769 125.0279 49.1819 22.2336 0.0183 2.5480 30.5220 47.1779 16.5230 4.0463 6.9520 1.0715 6.0127 2.5285 34.5471 27.3408 7.3965 117.2790 17.7883 109.3756 4.8122 45.8156 15.3358 10.5788 20.3087 0.4498 24.7083 14.3054 13.9658 3.6860 8.9824 10.0096 7.4574 133.0250 11.8788 4.0424 12.4972 13.8697 414.8973 79.1833 63.8847 10.9220 28.6031 22.1780 23.2622 22.5459 0.8042 6.1219 3.9105 7.4363 11.3603 4.4769 21.0310
temp: 298.150 k
press: 1.00000 atm
elementType: 8 8 8 8 6 6 6 6 6 6 6 6 6 6 6 6 6 6 6 6 1 1 1 1 1 1 1 1 1 1 1 1 1 1
symmnumber: 1
zpe: 683334.4 jmol-1
zpe.correction: 0.260268 hartree
zpe.thermalcorrener: 0.278096 hartree
zpe.thermalcorrenthalpy: 0.279040 hartree
zpe.thermalcorrgfe: 0.213052 hartree
zpe.sumelectzpe: -917.547756 hartree
zpe.sumelectthermal: -917.529929 hartree
zpe.sumelectthermalent: -917.528984 hartree
zpe.sumelectthermalfe: -917.594972 hartree
dipole: -2.3789 5.3098 -2.1434
dipole: 6.2006
quadrupole: -99.9809 -118.8681 -117.3363
quadrupole: 17.5659 -2.3252 5.9726
quadrupole: 12.0809 -6.8064 -5.2745 17.5659 -2.3252 5.9726
hfenergy: -917.8080245 hartree
pointgroup: C01 [X(C16H14O4)]
dipole: -1.1439313 1.1839101 1.8002797 debye
polarizability: 255.7660533|-27.2747072|138.1335812|17.9093181|2.0528432|165.3000413 unknown
InChI: InChI=1S/C16H14O4/c1-18-13-8-7-10(9-14(13)19-2)15-11-5-3-4-6-12(11)16(17)20-15/h3-9,15H,1-2H3
charge 0 multiplicity 1
34 atoms
O  1.904074 -0.71827 -1.789889
O  -3.590429 1.090085 -1.299131
O  3.838943 -2.030078 -1.918427
O  -4.20521 -1.371289 0.183461
C  1.259665 0.206585 -0.777459
C  2.200176 0.134501 0.41806
C  -0.178512 -0.203975 -0.526511
C  3.285382 -0.711604 0.110633
C  3.120764 -1.255029 -1.264509
C  2.11982 0.770487 1.670073
C  -1.234283 0.603596 -1.006758
C  -0.484916 -1.406946 0.159571
C  4.327723 -0.949545 1.029102
C  -2.580062 0.237335 -0.796599
C  3.161433 0.539581 2.601707
C  -1.825797 -1.770502 0.38734
C  -2.882346 -0.946805 -0.064033
C  4.25579 -0.309732 2.286452
C  -4.448594 0.474679 -2.341604
C  -5.032811 -0.430363 0.976641
H  1.284257 1.210108 -1.243019
H  1.275003 1.419086 1.92446
H  -1.035372 1.521508 -1.571676
H  0.322535 -2.052706 0.521352
H  5.158585 -1.61074 0.762675
H  3.123311 1.023159 3.584135
H  -2.085467 -2.68703 0.926426
H  5.0465 -0.468348 3.027439
H  -4.934958 -0.442822 -1.96391
H  -3.842994 0.23683 -3.236024
H  -5.201012 1.238613 -2.588886
H  -5.083973 0.560826 0.492415
H  -4.614133 -0.328929 1.995583
H  -6.030395 -0.892065 1.025512
