program: Gaussian 09
title: 000242185
version: EM64L-G09RevD.01
frameworkgroup: C1[X(C22H20O5S)]
method: RPBEPBE
basis: SDD
operation: Freq
keyword: #p
keyword: freq=noraman
keyword: PBEPBE/SDD
title: #p freq=noraman PBEPBE/SDD
converged: YES YES NO NO
title: Mulliken charges:
elementType: S O O O O O C C C C C C C C C C C C C C C C C C C C C C H H H H H H H H H H H H H H H H H H H H
charge: 0.880471 -0.545433 -0.554395 -0.273408 -0.334945 -0.205665 -0.479645 0.601679 -0.707732 -0.058272 -0.503995 -0.375428 0.186116 -0.307182 -0.255946 -0.270148 0.281846 -0.214193 -0.206275 -0.218434 0.130045 -0.513995 0.236883 -0.334969 -0.334182 -0.222524 -0.222874 -0.219350 0.284891 0.241519 0.262585 0.242053 0.259200 0.240931 0.255004 0.290912 0.286683 0.240076 0.240146 0.236413 0.247609 0.235264 0.222472 0.270661 0.276209 0.236729 0.236433 0.236161
chargesum: 0.00000
title: Mulliken charges with hydrogens summed into heavy atoms:
elementType: S O O O O O C C C C C C C C C C C C C C C C C C C C C C
charge: 0.880471 -0.545433 -0.554395 -0.273408 -0.334945 -0.205665 -0.194754 0.601679 0.038426 -0.058272 -0.244795 -0.134496 0.186116 -0.052178 0.034966 0.016535 0.281846 0.025883 0.033871 0.017979 0.130045 0.191350 0.236883 -0.064308 -0.057973 0.014205 0.013558 0.016810
polarizability: 5.08039469e+02 2.06080230e+00 2.49004967e+02 1.17642339e+01 1.11255864e+01 1.82031608e+02
1716.lowfreq: -11.9786 -2.9896 -2.7180 -0.0012 -0.0010 0.0013 8.3865 10.3995 17.1419
frequency: 8.3085 10.2784 17.0663 22.7410 33.6681 45.3801 46.3128 59.1123 66.7364 71.2281 118.0516 133.8068 141.5792 154.9136 167.0246 173.0849 181.6427 201.8411 215.5400 227.4692 242.4687 244.3518 249.2099 267.4833 308.4391 332.5313 339.8974 370.6216 394.6868 402.3983 405.2134 416.6020 430.4625 441.2171 448.2352 466.0150 485.8421 510.5352 559.0893 592.5944 603.5937 613.7195 632.9069 656.1233 661.9316 673.0673 694.1620 700.8227 704.7059 713.9296 756.0579 759.2424 784.7184 789.1818 795.7638 823.5259 855.6348 865.7494 870.3320 882.5560 907.6209 934.3277 948.8277 957.0818 970.0895 979.3746 984.0397 989.2648 994.3360 996.3974 997.7140 1004.4671 1008.3311 1011.0950 1030.1748 1038.4064 1047.2114 1072.7856 1075.8574 1086.1242 1104.2189 1110.8458 1145.8681 1152.1552 1172.2235 1175.0897 1175.3582 1177.6627 1184.9887 1191.5548 1234.1396 1251.8329 1282.9120 1299.5891 1316.2960 1323.9021 1382.7055 1388.8509 1390.1809 1390.7966 1411.3273 1433.9453 1438.6145 1445.4616 1451.5324 1458.2405 1462.8184 1471.0848 1476.5159 1483.4901 1492.8791 1577.8929 1578.1471 1586.0443 1601.6860 1608.2479 1611.3377 1643.9072 2981.9189 2985.2052 3066.5955 3077.6869 3089.6716 3095.8968 3121.7304 3133.1472 3134.1400 3142.6971 3145.1388 3151.1629 3156.6968 3160.0208 3162.5937 3162.7916 3167.9302 3171.4531 3178.9870 3182.8098
redmass: 6.5444 5.4663 6.2002 5.2704 4.9884 4.4116 4.2980 5.0985 5.3831 5.2941 5.3289 5.0048 3.3497 2.7249 2.7191 5.3239 3.9897 4.2556 3.3027 1.6699 2.9774 5.5582 3.4665 3.2498 5.7759 5.7518 5.5304 7.8898 5.4537 2.8348 2.8388 6.5100 4.9768 4.1529 6.4014 3.4301 5.7773 4.8394 5.4925 4.4118 6.4703 6.4436 4.5909 6.9258 6.2083 5.3481 2.3719 1.7095 3.8847 3.9923 5.0434 1.4565 4.7162 7.6015 2.1748 1.8169 1.2436 1.2447 5.3957 1.5742 7.9356 1.3592 1.3653 1.4142 1.6508 5.6077 1.3864 6.5783 6.5543 2.9274 1.5263 1.3409 4.1879 1.3321 2.0328 1.5412 2.1059 1.8660 2.0048 1.5868 1.3747 2.2198 1.3314 1.4452 1.0576 1.1258 1.0797 1.3659 1.2887 1.5280 3.7429 2.2323 1.7230 1.3094 1.3221 2.3283 8.1856 1.2550 8.9137 8.7415 1.8081 2.2218 2.2359 1.5262 2.0417 1.0579 1.0523 1.0582 2.2317 1.1929 2.2032 6.1636 6.9298 6.4059 6.8933 6.4756 6.2296 11.9293 1.0322 1.0362 1.0897 1.0971 1.1012 1.0990 1.1042 1.0857 1.0854 1.0881 1.0890 1.0925 1.0938 1.0968 1.0882 1.0917 1.0978 1.1016 1.0985 1.0972
irintensity: 3.0561 0.3725 1.7797 0.3192 0.2899 0.6612 2.7940 2.2639 1.3156 5.5583 1.9030 1.1442 2.1486 0.4888 0.8011 2.2401 5.0453 32.0079 1.5236 2.5168 4.7542 3.9143 2.8185 7.3168 1.5777 0.4158 2.9807 13.5053 1.5398 0.0075 0.0221 37.6229 3.9412 8.7008 21.2327 14.1253 14.4288 72.1914 4.3521 5.3209 0.0201 1.2219 15.3392 11.6773 23.6295 15.3743 31.5067 63.6059 25.2748 4.2433 4.8145 80.7118 7.9317 42.2390 18.8489 27.7705 0.8846 0.4198 11.8314 17.0281 56.6366 1.7338 0.8756 2.7066 24.7263 20.4425 0.0598 95.1220 208.8680 236.2227 31.5323 0.3884 0.9480 0.7171 50.0968 4.5794 25.0103 68.0298 87.1195 12.9604 9.1185 72.3472 39.9823 37.0903 0.0676 30.9440 5.1827 136.4476 35.1886 74.2984 408.1888 129.1473 90.5139 3.4659 0.9860 33.3489 3.2463 11.5532 8.6674 7.5815 80.0100 15.8666 16.4568 20.5565 16.4479 14.3986 10.9692 29.2709 8.8407 40.3112 71.5200 30.4525 30.7653 10.9586 0.5618 24.6883 15.5222 151.5999 68.3036 11.5750 4.7343 4.1608 32.5148 27.4068 25.1039 0.1595 0.6181 8.4109 7.9127 0.3565 14.7851 7.2148 4.5096 3.4547 25.6662 44.0358 8.5422 2.3589
temp: 298.150 k
press: 1.00000 atm
elementType: 16 8 8 8 8 8 6 6 6 6 6 6 6 6 6 6 6 6 6 6 6 6 6 6 6 6 6 6 1 1 1 1 1 1 1 1 1 1 1 1 1 1 1 1 1 1 1 1
symmnumber: 1
zpe: 953588.5 jmol-1
zpe.correction: 0.363203 hartree
zpe.thermalcorrener: 0.390421 hartree
zpe.thermalcorrenthalpy: 0.391365 hartree
zpe.thermalcorrgfe: 0.299876 hartree
zpe.sumelectzpe: -1622.354684 hartree
zpe.sumelectthermal: -1622.327465 hartree
zpe.sumelectthermalent: -1622.326521 hartree
zpe.sumelectthermalfe: -1622.418011 hartree
dipole: 0.6377 0.8275 -3.8030
dipole: 3.9439
quadrupole: -97.0674 -166.1674 -179.6282
quadrupole: 6.1949 22.7398 -1.4959
quadrupole: 50.5536 -18.5464 -32.0072 6.1949 22.7398 -1.4959
hfenergy: -1622.7178866 hartree
pointgroup: C01 [X(C22H20O5S1)]
dipole: -0.2358056 -0.1842165 -1.5225266 debye
polarizability: 507.7723651|10.6768012|250.9346337|-9.2511|-4.6268893|180.3690454 unknown
InChI: InChI=1S/C22H20O5S/c1-16(28(24,25)19-11-7-4-8-12-19)18-13-14-20(21(15-18)26-2)27-22(23)17-9-5-3-6-10-17/h3-16H,1-2H3
charge 0 multiplicity 1
48 atoms
S  3.550071 0.216887 0.979861
O  2.969584 -1.259207 1.389198
O  3.446852 1.507334 1.992615
O  -1.160538 -2.234932 -1.097501
O  -2.918152 -0.214091 0.120668
O  -3.822276 1.567495 -1.118979
C  2.647665 0.792261 -0.830255
C  1.188524 0.581898 -0.633897
C  3.174376 2.198689 -1.074047
C  5.394335 -0.008579 0.578989
C  0.626352 -0.680823 -0.93829
C  0.346791 1.607251 -0.117293
C  -0.752058 -0.94078 -0.762051
C  -1.019618 1.356421 0.083531
C  6.25496 1.080892 0.79268
C  5.826398 -1.270531 0.137802
C  -1.568549 0.092865 -0.225337
C  7.630861 0.896114 0.520355
C  7.205751 -1.43641 -0.130706
C  8.100505 -0.355213 0.054256
C  -3.985527 0.617213 -0.325048
C  -2.53695 -2.479855 -1.568925
C  -5.277837 0.175623 0.266521
C  -6.462082 0.825771 -0.1720
C  -5.352583 -0.852972 1.243049
C  -7.711362 0.445693 0.357324
C  -6.605884 -1.226511 1.771457
C  -7.785531 -0.581021 1.329531
H  3.108809 0.022905 -1.470904
H  2.667512 2.638059 -1.953257
H  2.985182 2.851889 -0.203231
H  4.259913 2.19415 -1.271047
H  1.245351 -1.497069 -1.323382
H  0.757945 2.585832 0.143432
H  -1.671964 2.131355 0.49514
H  5.858986 2.021682 1.19017
H  5.114656 -2.097992 0.045864
H  8.331953 1.722012 0.680697
H  7.579659 -2.407573 -0.471908
H  9.167784 -0.492456 -0.151347
H  -3.252078 -2.490326 -0.730702
H  -2.491553 -3.472336 -2.043119
H  -2.84239 -1.721631 -2.314124
H  -6.379672 1.620245 -0.921157
H  -4.433396 -1.337589 1.583644
H  -8.62408 0.946447 0.01756
H  -6.664404 -2.016214 2.527937
H  -8.757088 -0.874265 1.742624
