program: Gaussian 09
title: 000242863
version: EM64L-G09RevD.01
frameworkgroup: C1[X(C21H30O3)]
method: RPBEPBE
basis: SDD
operation: Freq
keyword: #pfreq=noraman
keyword: PBEPBE/SDD
title: #p freq=noraman PBEPBE/SDD
converged: YES YES NO NO
title: Mulliken charges:
elementType: O O O C C C C C C C C C C C C C C C C C C C C C H H H H H H H H H H H H H H H H H H H H H H H H H H H H H H
charge: -0.447132 -0.499966 -0.268757 0.437267 -0.137896 -0.109421 -0.304609 -0.644777 0.324661 -0.167357 -0.536360 -0.485147 -0.512314 -0.852900 -0.519290 0.255468 -0.582365 0.303037 -0.692880 -0.373348 -0.548813 -0.415984 0.319043 -0.536009 0.222260 0.242024 0.225927 0.249390 0.212083 0.203987 0.190910 0.226131 0.225755 0.189935 0.218480 0.214962 0.217284 0.253644 0.241901 0.221271 0.203520 0.222509 0.226170 0.367389 0.348427 0.266053 0.202805 0.211733 0.220313 0.253612 0.237768 0.242181 0.218441 0.218983
chargesum: 0.00000
title: Mulliken charges with hydrogens summed into heavy atoms:
elementType: O O O C C C C C C C C C C C C C C C C C C C C C
charge: -0.079743 -0.151540 -0.268757 0.437267 0.084365 0.132603 -0.078682 -0.183304 0.324661 0.036629 -0.119319 -0.069457 -0.078872 -0.140071 -0.094499 0.255468 -0.133686 0.303037 -0.012289 -0.153035 -0.295201 -0.178216 0.319043 0.143595
polarizability: 3.21303552e+02 -8.29963803e+00 2.13860782e+02 3.66622154e+00 7.31288174e+00 1.61884354e+02
1716.lowfreq: -12.9939 -3.3913 -0.0008 0.0007 0.0010 7.5949 23.3051 55.3575 68.9262
frequency: 22.9606 55.3391 68.5580 81.1802 87.2833 100.5927 133.4531 155.8497 165.7738 175.6834 188.2434 191.7208 209.0522 218.2202 220.5598 230.5462 245.8828 264.2101 268.6945 289.9198 302.2672 310.5927 324.0839 355.3623 369.1177 370.7154 388.3334 413.8378 414.9886 441.9380 456.4392 483.0914 492.0706 510.5803 530.6658 538.0591 549.8530 566.4252 584.8885 608.7964 627.7241 650.7792 710.0502 716.1750 745.1448 756.6724 777.3396 785.5392 813.1168 826.3882 846.6580 853.4858 872.4109 885.0720 893.3318 909.9003 924.2927 934.4484 943.6595 974.7103 990.6321 996.3098 1004.3939 1016.0595 1022.3066 1034.4031 1039.7329 1055.0500 1067.5158 1077.8555 1087.7304 1104.7787 1113.1424 1116.9711 1119.0450 1129.7899 1134.5572 1145.3054 1151.8743 1160.0607 1176.8112 1182.3493 1185.7968 1203.0611 1208.9735 1220.4173 1236.2164 1244.5416 1250.1761 1252.3005 1269.8400 1270.6667 1275.8143 1283.8112 1289.8236 1307.7164 1316.3181 1328.2164 1329.6505 1332.6578 1337.2915 1343.6017 1344.9447 1351.8806 1372.7310 1378.0269 1386.3851 1394.4667 1405.5234 1423.0671 1437.7590 1457.5865 1459.1809 1460.0979 1465.8924 1466.7737 1469.4704 1469.9319 1473.6808 1475.0809 1487.2245 1489.2803 1494.4869 1495.3104 1576.5959 1624.5955 2892.5185 2900.3459 2946.6902 2953.4155 2955.2091 2957.6237 2959.1431 2970.5304 2975.3531 2983.9641 2988.5338 2994.9316 2999.0410 3013.7104 3019.1407 3027.0256 3032.7812 3040.3035 3040.8618 3058.9918 3077.5865 3084.6541 3093.4229 3095.1687 3120.7191 3135.9240 3138.2166 3162.8504 3433.4675 3586.4480
redmass: 4.1017 4.0806 3.4695 3.7274 3.9672 3.4845 2.4392 3.0773 1.7821 2.3039 1.9903 1.6443 1.8952 1.6933 2.0072 1.6684 1.5261 2.8523 2.6788 3.0542 3.2273 3.2302 3.0124 3.5328 3.1307 2.5120 3.6030 3.4554 2.5818 2.8567 2.9789 2.5759 3.9980 2.5440 2.0554 3.3558 1.9161 2.7309 4.1598 4.0077 2.7985 2.7232 4.9228 3.4210 3.0358 4.2627 2.1479 1.3155 1.6879 1.9637 2.1071 2.1669 2.4646 2.7325 1.6048 2.2279 1.9802 1.4142 1.7624 1.8392 1.8146 2.0970 3.8895 2.2084 3.7324 2.6759 2.0390 2.5171 2.4316 1.7767 1.5508 2.3510 1.2647 2.3067 2.0107 1.9076 1.6769 1.5940 1.9191 1.8686 1.4206 1.4374 1.6129 1.6982 1.6544 1.7816 1.4455 1.7700 2.1949 1.7364 1.4643 1.4006 1.4124 1.3476 1.3956 1.3866 1.3739 1.4461 1.5340 1.4551 1.4702 1.5367 1.6302 1.5236 2.9771 1.9289 1.2367 1.2016 1.2002 3.1647 1.2472 1.1269 1.0755 1.0803 1.0502 1.0926 1.0882 1.0824 1.0395 1.0771 1.0585 1.0611 2.4726 1.0596 7.0859 6.8006 1.0803 1.0789 1.0651 1.0642 1.0332 1.0653 1.0720 1.0730 1.0844 1.0603 1.0368 1.0389 1.0580 1.0947 1.0935 1.0951 1.1013 1.1021 1.1036 1.1033 1.0993 1.0983 1.0998 1.0984 1.0991 1.0903 1.0874 1.0948 1.0640 1.0666
irintensity: 0.4000 1.1799 0.6237 6.6487 0.8530 1.7554 0.8727 2.4188 14.4373 36.8117 3.6265 41.7024 0.6524 0.6929 6.5407 3.8979 0.4163 2.9565 1.4948 6.1607 0.8638 5.5933 2.6522 2.5502 1.1190 3.3900 0.7359 1.0888 0.6693 6.5181 5.6928 1.6922 3.1960 29.1344 36.4101 33.7250 64.6382 2.7475 8.9970 5.5786 1.5549 1.6030 3.9524 3.7074 18.1632 23.1564 20.4397 3.0866 22.0989 2.3643 11.4006 0.7879 9.9718 3.4449 32.0053 25.9843 3.1850 0.9813 13.3045 17.1423 6.1191 10.8882 60.8207 24.2526 73.9971 5.8472 9.6946 20.7617 21.4724 13.8264 29.2512 13.0475 0.1610 1.8301 6.8710 22.2379 7.1809 9.0168 0.0464 9.5560 37.6436 4.6820 7.2907 18.4430 8.6865 24.4368 2.2826 71.8228 49.6119 9.0694 3.1691 27.2664 17.3932 3.7694 1.5967 1.1544 0.9884 6.9203 5.2034 1.1546 2.4640 7.5029 7.6592 2.3587 11.6603 13.9927 18.7281 49.5545 26.1807 24.5169 2.2694 10.4519 4.0902 3.2388 12.4673 15.1755 0.8804 13.9397 13.2229 53.2127 13.1797 5.5533 113.3752 5.7846 24.5284 71.2426 8.8563 25.0052 33.2901 33.0244 80.5325 25.1316 6.0895 30.1945 56.5033 30.7322 32.7728 28.3030 20.0211 22.4589 41.1122 35.6269 45.9551 48.6435 65.1629 29.8062 41.0825 16.6313 33.5137 27.3855 31.0622 16.1933 3.7671 19.3981 52.8400 6.6603
temp: 298.150 k
press: 1.00000 atm
elementType: 8 8 8 6 6 6 6 6 6 6 6 6 6 6 6 6 6 6 6 6 6 6 6 6 1 1 1 1 1 1 1 1 1 1 1 1 1 1 1 1 1 1 1 1 1 1 1 1 1 1 1 1 1 1
symmnumber: 1
zpe: 1224646.1 jmol-1
zpe.correction: 0.466443 hartree
zpe.thermalcorrener: 0.489697 hartree
zpe.thermalcorrenthalpy: 0.490642 hartree
zpe.thermalcorrgfe: 0.415939 hartree
zpe.sumelectzpe: -1042.056216 hartree
zpe.sumelectthermal: -1042.032961 hartree
zpe.sumelectthermalent: -1042.032017 hartree
zpe.sumelectthermalfe: -1042.106720 hartree
dipole: -0.0271 1.9227 -0.8371
dipole: 2.0972
quadrupole: -131.5432 -143.9384 -146.2591
quadrupole: -26.6676 -1.3677 2.2328
quadrupole: 9.0370 -3.3581 -5.6789 -26.6676 -1.3677 2.2328
hfenergy: -1042.5226587 hartree
pointgroup: C01 [X(C21H30O3)]
dipole: -0.0070855 -0.7498273 0.3442792 debye
polarizability: 321.2053376|9.1263446|214.2870838|-2.4269857|6.3224254|161.556266 unknown
InChI: InChI=1S/C21H30O3/c1-4-21(23)12-18-17-7-5-13-11-14(24-3)6-8-15(13)16(17)9-10-20(18,2)19(21)22/h6,8,11,16-19,22-23H,4-5,7,9-10,12H2,1-3H3
charge 0 multiplicity 1
54 atoms
O  -4.563651 1.805812 -0.451083
O  -4.790251 -0.588993 -1.450155
O  6.38169 -0.420696 -0.172788
C  -2.152295 0.971714 -0.297691
C  -1.627784 -0.417189 0.185714
C  -0.145167 -0.643466 -0.159568
C  -3.642616 0.855777 0.151096
C  -2.700128 -1.415605 -0.316299
C  -4.052041 -0.647865 -0.151272
C  0.695795 0.469279 0.544382
C  -1.337107 2.071371 0.420151
C  0.187585 1.896657 0.181879
C  0.390945 -2.028139 0.260537
C  -2.091934 1.16791 -1.834588
C  -4.958668 -1.260778 0.93953
C  2.203322 0.263771 0.31881
C  1.82426 -2.226154 -0.272113
C  2.730437 -1.019843 -0.029218
C  -6.265339 -0.484796 1.215263
C  3.121836 1.325855 0.50179
C  4.123365 -1.18962 -0.179567
C  4.516735 1.162934 0.351155
C  5.019622 -0.113505 0.005609
C  7.343487 0.665518 0.016613
H  -1.692337 -0.404417 1.300401
H  -0.012034 -0.551857 -1.259063
H  -3.698795 1.027379 1.245785
H  -2.548067 -1.651098 -1.385952
H  -2.696133 -2.367548 0.246147
H  0.505499 0.338123 1.636736
H  -1.539727 2.019496 1.51165
H  -1.658158 3.075787 0.082901
H  0.441326 2.116133 -0.873757
H  0.719965 2.651014 0.79175
H  -0.262134 -2.832852 -0.128234
H  0.378732 -2.103971 1.367732
H  -1.056347 1.160077 -2.213566
H  -2.663787 0.393958 -2.374406
H  -2.539212 2.145638 -2.087503
H  -4.363417 -1.326293 1.872065
H  -5.194624 -2.311132 0.658566
H  1.775146 -2.414898 -1.365228
H  2.284095 -3.129332 0.173306
H  -4.968177 1.32497 -1.227219
H  -5.439709 -1.333257 -1.4916
H  -6.05688 0.56246 1.49281
H  -6.922456 -0.459025 0.326653
H  -6.828966 -0.960185 2.038333
H  2.749365 2.319118 0.772893
H  4.538324 -2.169113 -0.443638
H  5.182166 2.017938 0.504202
H  8.329313 0.213597 -0.168401
H  7.30466 1.065028 1.049283
H  7.170574 1.489507 -0.703533
