program: Gaussian 09
title: 000240325
version: EM64L-G09RevD.01
frameworkgroup: C1[X(C14H16Cl2O4)]
method: RPBEPBE
basis: SDD
operation: Freq
keyword: #p
keyword: freq=noraman
keyword: PBEPBE/SDD
title: #p freq=noraman PBEPBE/SDD
converged: YES YES NO NO
title: Mulliken charges:
elementType: Cl Cl O O O O C C C C C C C C C C C C C C H H H H H H H H H H H H H H H H
charge: -0.037384 -0.061823 -0.239496 -0.273976 -0.275863 -0.216319 -0.424034 -0.445345 -0.439830 -0.118017 -0.091331 0.247017 0.500939 -0.259389 -0.305673 -0.251233 -0.208023 -0.236900 -0.661426 -0.103110 0.230479 0.215414 0.244992 0.249233 0.245786 0.217275 0.246827 0.255957 0.224005 0.238684 0.301641 0.278848 0.255745 0.219761 0.250046 0.226523
chargesum: 0.00000
title: Mulliken charges with hydrogens summed into heavy atoms:
elementType: Cl Cl O O O O C C C C C C C C C C C C C C
charge: -0.037384 -0.061823 -0.239496 -0.273976 -0.275863 -0.216319 0.021859 0.048880 0.023231 0.128810 0.164626 0.247017 0.500939 0.203300 -0.305673 0.050408 0.070824 0.018845 0.034904 -0.103110
polarizability: 2.16321891e+02 3.12891871e+01 1.77167319e+02 1.20394034e+00 -1.55714008e+01 1.50237326e+02
1716.lowfreq: -10.5403 -6.3237 -0.0030 -0.0028 -0.0027 3.4398 12.5703 25.5429 30.5216
frequency: 11.9671 25.3685 30.4958 39.7890 56.5362 79.5403 89.7920 95.1807 137.6452 156.3352 165.3252 168.2536 202.3249 218.3547 240.8492 263.1238 283.6775 314.5662 340.1024 352.2191 367.8687 391.1409 409.9893 434.0303 437.6890 455.1272 507.8098 545.9451 579.9695 608.0127 634.1577 668.1508 694.1630 708.1878 714.5857 766.3532 780.6138 790.0760 809.3141 817.1338 847.3804 856.7170 866.6744 874.3418 910.8813 930.7807 938.3448 982.3766 1015.2291 1022.8486 1040.1693 1057.9281 1080.0666 1093.2928 1097.2294 1120.0481 1132.0787 1144.7135 1156.6487 1174.1807 1202.4375 1220.8037 1248.9903 1254.1270 1276.0783 1278.9501 1304.7878 1315.3628 1324.4874 1336.3126 1348.3056 1353.2099 1357.1169 1361.1154 1386.1411 1392.5316 1455.9829 1457.8682 1458.8788 1464.1196 1465.1585 1471.4858 1484.9299 1571.3857 1592.0671 1657.1726 2993.6656 2994.1818 3007.8063 3017.5400 3020.2049 3031.3157 3040.3293 3059.9815 3084.1267 3088.7756 3090.4602 3094.1409 3120.3077 3167.6093 3182.6921 3186.4737
redmass: 6.8239 6.5466 5.7789 3.6662 4.1118 3.9661 4.9539 4.9699 4.1589 6.7696 5.7022 6.7907 2.5974 2.0259 2.2763 4.1719 2.3717 5.6741 6.8081 4.3674 8.0614 6.4961 5.0994 4.0126 3.2771 3.5446 4.3788 4.1698 5.7992 4.7926 7.2615 5.1000 3.3920 4.3619 3.2409 4.0810 2.4770 2.9028 1.4876 1.5196 3.1611 1.3867 2.9141 3.3278 2.3986 1.5581 2.3094 2.5911 2.9281 4.1839 2.9124 2.5862 2.3376 2.4428 2.2457 2.5935 3.2485 1.3432 1.6575 1.3868 1.5407 2.9092 1.3273 1.2794 1.2342 1.1228 1.2917 1.3349 1.2669 1.3955 1.4352 1.2746 1.2807 4.3304 5.3457 1.2321 1.0982 2.2686 1.0918 1.0487 1.1219 1.0942 1.0513 8.1262 7.6493 10.4232 1.0365 1.0630 1.0831 1.0647 1.0613 1.0596 1.0861 1.0988 1.1026 1.0975 1.1041 1.1031 1.1063 1.0892 1.0934 1.0969
irintensity: 0.1640 0.0395 1.1019 0.4492 2.3021 1.7171 0.4078 0.4088 0.4777 2.7213 0.7185 1.7685 1.2451 3.1449 3.0004 2.4307 1.4427 15.7889 6.9403 6.5929 2.9965 5.6638 12.2416 0.8978 6.7154 0.4094 5.1912 5.8868 6.3011 20.9298 17.5968 14.3315 4.2517 5.7123 17.5203 84.1460 3.6247 15.9783 48.5993 4.6107 14.1606 22.7374 85.7700 97.8253 119.3556 7.6455 29.8100 17.9632 47.3842 184.8546 173.0893 23.3191 40.4236 28.2786 25.5066 14.6619 237.2689 1.1521 6.1457 9.5358 45.4576 113.6345 30.7828 5.3062 10.5209 1.4836 18.0145 12.2763 3.7952 5.4814 4.0965 13.5280 2.2217 16.3244 1.8305 24.4152 19.2487 222.9269 15.6125 17.9649 16.4439 5.2114 12.4157 20.7658 2.2293 197.1608 18.2308 38.7235 18.8530 12.2963 11.9994 26.2998 38.7728 24.2340 16.5413 28.6168 36.7381 1.0221 31.7563 1.4346 0.3266 0.3165
temp: 298.150 k
press: 1.00000 atm
elementType: 17 17 8 8 8 8 6 6 6 6 6 6 6 6 6 6 6 6 6 6 1 1 1 1 1 1 1 1 1 1 1 1 1 1 1 1
symmnumber: 1
zpe: 723460.3 jmol-1
zpe.correction: 0.275551 hartree
zpe.thermalcorrener: 0.295660 hartree
zpe.thermalcorrenthalpy: 0.296604 hartree
zpe.thermalcorrgfe: 0.223172 hartree
zpe.sumelectzpe: -1762.580748 hartree
zpe.sumelectthermal: -1762.560640 hartree
zpe.sumelectthermalent: -1762.559696 hartree
zpe.sumelectthermalfe: -1762.633128 hartree
dipole: -4.9440 -0.6333 -0.4640
dipole: 5.0060
quadrupole: -128.4425 -121.0727 -128.1195
quadrupole: -3.6324 -2.3004 6.5017
quadrupole: -2.5642 4.8055 -2.2413 -3.6324 -2.3004 6.5017
hfenergy: -1762.8562997 hartree
pointgroup: C01 [X(C14H16Cl2O4)]
dipole: -1.766894 -0.7961829 -0.3508991 debye
polarizability: 195.495566|39.9420992|192.240435|6.8196553|-14.2973748|155.9905344 unknown
InChI: InChI=1S/C14H16Cl2O4/c1-2-18-14(17)12-4-3-5-13(20-12)19-11-7-6-9(15)8-10(11)16/h6-8,12-13H,2-5H2,1H3
charge 0 multiplicity 1
36 atoms
Cl 2.041293 -0.906496 2.735765
Cl 4.515903 3.119879 -0.184941
O  -1.085554 -1.237255 -1.635243
O  0.45196 -1.325834 0.261002
O  -3.675869 0.720026 0.077738
O  -1.515552 1.335779 -0.569818
C  -2.101234 -3.385137 -0.175274
C  -2.554427 -1.98232 0.281146
C  -0.575325 -3.389657 -0.461597
C  -2.342596 -0.997442 -0.896001
C  -0.071076 -2.013718 -0.945169
C  -2.410497 0.474679 -0.462155
C  1.369159 -0.27813 0.088847
C  -3.947448 2.1211 0.536353
C  2.200058 0.038416 1.192754
C  1.500414 0.478987 -1.101098
C  3.15648 1.068137 1.125455
C  2.461642 1.50742 -1.193292
C  -4.443497 2.983597 -0.626614
C  3.275945 1.785438 -0.080649
H  -2.339713 -4.137731 0.596532
H  -2.660751 -3.666827 -1.088184
H  -3.620803 -1.965573 0.561735
H  -1.96516 -1.662464 1.158911
H  -0.006883 -3.645688 0.449088
H  -0.334272 -4.146041 -1.229331
H  -3.141703 -1.155793 -1.645599
H  0.743413 -2.088142 -1.688104
H  -4.713957 1.99198 1.316902
H  -3.020023 2.529407 0.974722
H  0.805077 0.304621 -1.925315
H  3.790171 1.293715 1.986365
H  2.553261 2.095207 -2.110359
H  -4.720108 3.986924 -0.25287
H  -3.655259 3.107007 -1.388051
H  -5.333772 2.534827 -1.10005
