program: Gaussian 09
title: 000240318
version: EM64L-G09RevD.01
frameworkgroup: C1[X(C11H15N)]
method: RPBEPBE
basis: SDD
operation: Freq
keyword: #pfreq=noraman
keyword: PBEPBE/SDD
title: #p freq=noraman PBEPBE/SDD
converged: YES YES NO NO
title: Mulliken charges:
elementType: N C C C C C C C C C C C H H H H H H H H H H H H H H H
charge: -0.153656 0.400341 0.516770 -0.347537 -0.355758 -0.484548 -0.391892 -0.628174 -0.647413 -0.647204 -0.023150 -0.593780 0.232789 0.232615 0.221841 0.233852 0.209467 0.215435 0.214022 0.230711 0.231096 0.231383 0.213850 0.231218 0.229721 0.212256 0.215744
chargesum: 0.00000
title: Mulliken charges with hydrogens summed into heavy atoms:
elementType: N C C C C C C C C C C C
charge: -0.153656 0.400341 0.516770 -0.114748 -0.123143 -0.262707 -0.158041 -0.203272 0.028417 0.029247 0.206571 -0.165780
polarizability: 1.95646673e+02 7.58990229e+00 1.21634069e+02 7.29559717e+00 2.60414882e+00 7.49525795e+01
1716.lowfreq: -14.7173 -4.0478 -0.0010 -0.0009 -0.0007 10.5582 33.6384 65.1212 71.3376
frequency: 33.5847 64.9820 71.2430 78.3906 99.8074 162.4637 199.7256 203.5605 247.5557 304.5959 336.0715 392.1511 411.0957 419.9268 474.3352 506.6296 525.4487 615.6342 635.6577 703.5581 736.6072 800.7105 809.2285 825.4007 902.0070 930.3771 939.5879 941.9714 945.0441 955.7917 998.6645 1013.8633 1055.5926 1105.7132 1108.6593 1111.9529 1130.9439 1163.0370 1195.7966 1209.1574 1221.4569 1265.3245 1279.0454 1292.8208 1330.8764 1356.3252 1379.2126 1421.5725 1424.4226 1436.0165 1455.8653 1458.8000 1462.0543 1472.5664 1494.0027 1506.5941 1527.1043 1566.4928 1634.4275 1652.2814 2929.2908 2938.5191 2959.7872 2992.0898 2994.6770 3010.2632 3080.0167 3088.8667 3094.0371 3099.9906 3111.5994 3120.4952 3157.9644 3162.2612 3192.3912
redmass: 3.1866 3.1619 2.6888 2.3622 1.7379 1.9693 1.4697 1.6818 2.3579 3.6585 3.0804 2.7324 2.5601 2.9276 3.3871 2.6449 2.1066 1.9057 6.8804 2.7539 3.7248 2.2914 1.3027 2.4478 1.4336 1.9638 1.3681 1.6930 2.4480 1.3463 2.9662 1.1476 1.4805 1.6448 1.3075 1.2508 1.4697 1.7590 1.2597 1.2761 1.9777 2.8964 1.3600 1.3119 1.4376 3.3458 5.1696 1.5117 1.4108 1.5292 1.1438 1.1622 1.0415 1.0465 1.0832 1.0972 2.6160 6.6158 6.1789 4.6714 1.0368 1.0397 1.0590 1.0988 1.1030 1.1001 1.0631 1.0958 1.0903 1.0935 1.0890 1.0886 1.0926 1.0934 1.1142
irintensity: 0.2067 3.0252 1.3730 2.4204 0.2938 0.4121 0.1814 0.2078 1.0426 0.1681 3.7762 4.7971 0.7684 0.3238 3.4998 2.9134 21.7410 11.4582 0.3890 2.8492 1.8139 43.2865 0.8813 38.3994 17.6714 20.4561 17.1699 55.9238 9.5817 0.0296 0.5003 22.8351 27.5945 4.1975 0.5729 0.1277 4.0441 10.9451 18.4374 0.4956 8.1133 36.0378 5.1571 6.6762 5.5685 108.9850 6.9296 11.3070 1.7086 0.2407 23.6490 3.1772 0.1517 20.2055 1.9857 31.5210 278.3700 5.5069 124.1839 33.7733 125.9763 88.4373 39.1639 0.6287 102.7681 18.1377 19.4345 5.1114 9.5509 51.4903 19.3038 13.2477 29.5299 10.1341 31.6410
temp: 298.150 k
press: 1.00000 atm
elementType: 7 6 6 6 6 6 6 6 6 6 6 6 1 1 1 1 1 1 1 1 1 1 1 1 1 1 1
symmnumber: 1
zpe: 603731.6 jmol-1
zpe.correction: 0.229949 hartree
zpe.thermalcorrener: 0.242759 hartree
zpe.thermalcorrenthalpy: 0.243703 hartree
zpe.thermalcorrgfe: 0.189908 hartree
zpe.sumelectzpe: -481.985388 hartree
zpe.sumelectthermal: -481.972578 hartree
zpe.sumelectthermalent: -481.971634 hartree
zpe.sumelectthermalfe: -482.025429 hartree
dipole: 2.6919 -0.2097 0.1104
dipole: 2.7023
quadrupole: -61.8888 -67.7971 -75.8542
quadrupole: -0.3875 1.4999 0.5926
quadrupole: 6.6245 0.7163 -7.3408 -0.3875 1.4999 0.5926
hfenergy: -482.215337 hartree
pointgroup: C01 [X(C11H15N1)]
dipole: -1.0610067 -0.0249199 -0.0632476 debye
polarizability: 194.6475693|-12.2043832|121.8131572|6.4860655|6.162177|75.7725951 unknown
InChI: InChI=1S/C11H15N/c1-4-5-10-6-8-11(9-7-10)12(2)3/h4,6-9H,1,5H2,2-3H3
charge 0 multiplicity 1
27 atoms
N  -2.9470 -0.075682 -0.16839
C  -1.560234 0.07598 -0.0254
C  1.298025 0.386244 0.27422
C  -0.969857 1.362445 0.180905
C  -0.678461 -1.050671 -0.082513
C  0.425372 1.500382 0.325235
C  0.712002 -0.887973 0.063426
C  2.807676 0.545562 0.46174
C  -3.821714 1.09885 -0.101577
C  -3.520843 -1.407957 -0.380931
C  3.62977 -0.148145 -0.61049
C  4.604329 -1.063721 -0.37757
H  -1.596466 2.257774 0.227664
H  -1.078195 -2.056464 -0.242147
H  0.843467 2.503479 0.481994
H  1.36118 -1.770817 0.006968
H  3.050237 1.628183 0.458534
H  3.118179 0.158077 1.453351
H  -4.86985 0.784024 -0.228381
H  -3.589347 1.835069 -0.899259
H  -3.739593 1.621453 0.874298
H  -3.137968 -1.8805 -1.309429
H  -4.615732 -1.325711 -0.471643
H  -3.300398 -2.094118 0.463276
H  3.388098 0.132186 -1.647392
H  5.169635 -1.523999 -1.195902
H  4.864986 -1.37665 0.641812
