program: Gaussian 09
title: 000240657
version: EM64L-G09RevD.01
frameworkgroup: C1[X(C14H16N2O4)]
method: RPBEPBE
basis: SDD
operation: Freq
keyword: #p
keyword: freq=noraman
keyword: PBEPBE/SDD
title: #p freq=noraman PBEPBE/SDD
converged: YES YES NO NO
title: Mulliken charges:
elementType: O O O O N N C C C C C C C C C C C C C C H H H H H H H H H H H H H H H H
charge: -0.247066 -0.424822 -0.276635 -0.227298 -0.368944 0.000733 -0.094704 -0.197271 -0.320942 -0.168750 -0.462471 -0.455463 0.241165 0.132291 -0.519757 0.471819 -0.301057 -0.501639 -0.186854 -0.329320 0.247922 0.285390 0.287386 0.298705 0.239672 0.235315 0.237324 0.232477 0.307643 0.384718 0.270046 0.229784 0.253009 0.248179 0.233645 0.245770
chargesum: 0.00000
title: Mulliken charges with hydrogens summed into heavy atoms:
elementType: O O O O N N C C C C C C C C C C C C C C
charge: -0.247066 -0.040105 -0.276635 -0.227298 -0.061301 0.000733 0.153217 0.088119 -0.033556 0.129955 0.012516 0.014338 0.241165 0.132291 -0.019926 0.471819 -0.048048 -0.253460 0.046791 -0.083550
polarizability: 2.21527605e+02 2.05407032e-01 1.67238468e+02 1.60714064e+01 3.21338273e+00 1.14046231e+02
1716.lowfreq: -6.0280 -4.5586 -0.0005 -0.0001 0.0007 6.1941 10.1973 18.8563 31.4201
frequency: 6.5576 18.8349 31.3184 37.2951 43.5228 65.9965 113.6930 136.8495 160.6401 207.2845 221.8824 241.8024 256.8051 309.5178 322.4496 352.9889 388.5326 408.0579 455.4717 492.3604 498.1162 539.4480 574.8604 587.2739 610.4115 629.5567 636.5208 661.2922 678.1405 724.1537 727.2098 751.8020 777.5402 796.6982 804.8915 826.3828 840.4713 857.1062 892.7440 909.3784 916.1995 924.8487 939.5158 945.8477 963.4022 989.9191 993.9674 1002.9364 1019.2523 1026.8145 1027.6393 1037.9665 1053.4465 1078.3770 1087.2355 1115.4168 1144.2158 1174.3444 1186.0341 1191.7637 1202.6839 1204.8984 1216.1447 1230.5154 1236.1380 1239.4093 1262.3532 1267.1825 1284.5409 1293.1239 1301.3427 1309.9783 1321.5659 1331.9259 1350.7359 1361.1328 1417.2716 1456.9884 1458.3906 1469.5540 1474.9691 1490.4306 1559.1657 1587.5567 1606.3849 1658.5626 2991.8747 2994.5100 3027.1169 3038.4561 3049.8061 3050.6790 3086.9405 3105.8666 3109.3377 3109.9812 3130.8315 3136.0639 3138.1211 3165.9969 3512.3439 3547.5351
redmass: 5.1059 5.0885 6.4186 8.4133 6.3047 4.5347 5.4117 4.9257 4.6965 4.0231 4.0071 6.1514 2.8160 3.6568 3.6832 4.3273 2.8327 3.5420 4.1870 4.6550 3.1266 3.7001 1.7007 3.2589 3.5028 3.7632 2.1255 3.4327 3.6493 2.0133 3.9456 4.5224 5.3734 2.4347 2.3593 2.5657 1.9794 4.7351 3.0026 3.7087 2.6215 1.4296 2.1578 1.9781 4.6057 1.4146 2.3692 3.2054 2.3741 3.3209 2.4683 3.2626 1.8249 2.5267 2.1150 1.6002 1.1896 1.2814 1.3908 1.4838 1.4889 1.3421 1.3872 1.9603 1.2190 1.3163 1.4407 1.4990 1.4283 1.5388 1.8736 6.3829 1.5150 1.3329 1.6328 1.3935 2.0322 1.4356 1.3072 1.2398 1.1044 1.8591 5.4790 5.7545 5.9752 9.2810 1.0608 1.0812 1.0586 1.0618 1.0866 1.0996 1.1053 1.1006 1.0962 1.0912 1.0876 1.0925 1.0926 1.1000 1.0639 1.0778
irintensity: 0.4199 1.7229 2.1722 1.5918 3.6860 2.8129 5.9595 3.2000 0.3681 1.5317 7.0764 4.1780 5.6259 9.2863 4.2602 0.4571 4.5889 9.6464 5.5378 8.1686 46.5482 31.5107 52.1192 7.0289 30.7254 15.8831 101.3129 22.6251 25.2605 37.3717 3.7067 11.0989 22.8856 8.1694 21.6941 13.8697 36.6342 8.5711 13.9385 10.6531 7.7184 2.0554 2.8316 4.3341 33.3290 1.7223 10.3820 1.6333 24.0509 16.1652 26.1602 14.5195 13.0757 49.2469 116.5084 11.3964 5.7377 22.8544 9.8640 31.5584 55.1522 33.7774 5.1702 1.8342 39.6691 29.2876 9.9033 15.6480 9.8951 15.6105 23.2001 4.9951 7.7251 5.9217 23.1982 12.8461 23.0484 25.8227 17.3930 24.3045 27.9065 236.5349 5.3248 1.2814 132.6384 272.4343 38.7694 19.7793 27.0610 30.9480 7.2215 11.5524 1.4032 23.1222 31.0325 27.2810 0.2751 7.3069 21.7161 20.8299 24.2620 21.7329
temp: 298.150 k
press: 1.00000 atm
elementType: 8 8 8 8 7 7 6 6 6 6 6 6 6 6 6 6 6 6 6 6 1 1 1 1 1 1 1 1 1 1 1 1 1 1 1 1
symmnumber: 1
zpe: 748882.7 jmol-1
zpe.correction: 0.285234 hartree
zpe.thermalcorrener: 0.302821 hartree
zpe.thermalcorrenthalpy: 0.303765 hartree
zpe.thermalcorrgfe: 0.234871 hartree
zpe.sumelectzpe: -952.014083 hartree
zpe.sumelectthermal: -951.996497 hartree
zpe.sumelectthermalent: -951.995553 hartree
zpe.sumelectthermalfe: -952.064446 hartree
dipole: -1.3529 0.0927 -0.7744
dipole: 1.5616
quadrupole: -147.1139 -101.8224 -123.5561
quadrupole: -9.5834 3.0371 4.6663
quadrupole: -22.9497 22.3418 0.6080 -9.5834 3.0371 4.6663
hfenergy: -952.2993178 hartree
pointgroup: C01 [X(C14H16N2O4)]
dipole: -0.529243 0.0975086 -0.2964129 debye
polarizability: 220.605245|-1.2571843|158.1856037|17.8246037|20.9495736|124.0214555 unknown
InChI: InChI=1S/C14H16N2O4/c17-13(16-7-8-2-1-5-15-6-8)11-9-3-4-10(20-9)12(11)14(18)19/h1-2,5-6,9-12,16,18H,3-4,7H2
charge 0 multiplicity 1
36 atoms
O  2.724837 2.024782 -0.721322
O  3.18501 -1.98061 -1.28428
O  0.309707 -0.896697 1.529777
O  5.065248 -0.880944 -0.489972
N  -0.74347 -1.054221 -0.538719
N  -5.539897 -0.911007 -1.022265
C  1.321574 1.639282 -0.393157
C  3.33359 1.325805 0.457183
C  1.441545 0.067607 -0.431111
C  2.832897 -0.140651 0.258805
C  1.143678 2.174514 1.053984
C  2.582738 1.968666 1.651976
C  0.308972 -0.675848 0.276388
C  3.820304 -0.985765 -0.522055
C  -1.931558 -1.754323 -0.0201
C  -3.220581 -0.966164 -0.206152
C  -3.350846 0.365159 0.265344
C  -4.345488 -1.549217 -0.840431
C  -4.575623 1.042174 0.089274
C  -5.639822 0.368584 -0.557557
H  0.649314 2.062488 -1.152711
H  4.423634 1.444754 0.424393
H  1.49667 -0.237368 -1.489604
H  2.674955 -0.638946 1.236748
H  0.377386 1.623606 1.622908
H  0.870163 3.242063 1.02575
H  3.047707 2.931522 1.919416
H  2.57727 1.318754 2.542974
H  -0.683833 -0.872788 -1.542531
H  3.879289 -2.535405 -1.733514
H  -1.727166 -1.923147 1.053819
H  -2.024122 -2.745529 -0.504132
H  -2.506225 0.854555 0.764034
H  -4.294901 -2.577051 -1.223471
H  -4.712008 2.068137 0.445534
H  -6.606349 0.860737 -0.71442
