program: Gaussian 09
title: 000240308
version: EM64L-G09RevD.01
frameworkgroup: C1[X(C11H14O4)]
method: RPBEPBE
basis: SDD
operation: Freq
keyword: #pfreq=noraman
keyword: PBEPBE/SDD
title: #p freq=noraman PBEPBE/SDD
converged: YES YES NO NO
title: Mulliken charges:
elementType: O O O O C C C C C C C C C C C H H H H H H H H H H H H H H
charge: -0.274138 -0.285338 -0.224679 -0.229188 -0.253089 -0.267600 -0.230194 -0.232752 -0.525604 -0.228804 -0.217199 0.218882 0.223576 -0.509185 -0.503598 0.275949 0.258157 0.280674 0.279790 0.273451 0.247459 0.243622 0.244793 0.235328 0.238194 0.242872 0.243409 0.234436 0.240779
chargesum: 0.00000
title: Mulliken charges with hydrogens summed into heavy atoms:
elementType: O O O O C C C C C C C C C C C
charge: -0.274138 -0.285338 -0.224679 -0.229188 0.022860 -0.009443 0.050480 0.047038 -0.004695 0.014817 0.027594 0.218882 0.223576 0.207208 0.215026
polarizability: 1.42250760e+02 -3.48883914e+00 1.18705485e+02 -2.40284784e+00 -5.95559120e+00 1.04618972e+02
1716.lowfreq: -12.4354 -0.0005 0.0006 0.0008 10.1773 16.3459 42.1079 63.9702 73.6833
frequency: 41.8738 63.9372 73.5847 78.9187 90.8296 112.7205 119.1540 142.5151 186.3946 220.5958 254.8744 264.1351 295.9536 317.3894 354.8726 404.5113 487.5948 507.3692 596.5320 645.2743 680.3895 688.6550 722.7166 757.5113 765.2498 780.9113 807.0000 851.0424 888.6296 894.7055 909.2922 913.9264 931.0652 945.3370 981.2185 993.5789 1005.5804 1012.2102 1039.2176 1091.7880 1101.3701 1109.3592 1112.1893 1133.9490 1146.1572 1148.1298 1149.8011 1168.2465 1193.8748 1229.3837 1243.1075 1257.8954 1264.5583 1272.2899 1306.2847 1316.4829 1328.1257 1418.5909 1420.4344 1451.4762 1452.8054 1460.3574 1466.9816 1479.4903 1578.8263 1632.7899 1643.5193 3001.5353 3003.0476 3028.5055 3041.0240 3079.1294 3088.6859 3101.6428 3104.5339 3109.9686 3120.3707 3147.4349 3147.9997 3156.7093 3189.3876
redmass: 4.9670 4.1646 3.6310 4.9407 1.5236 1.0718 1.9691 4.1158 4.4286 5.3045 4.4771 5.2214 4.0485 3.9155 7.7538 4.3183 2.2020 3.1006 5.3293 4.3167 4.7935 5.7727 1.8870 4.5361 4.5981 4.8699 4.8615 4.7858 4.1899 3.4202 2.2656 1.9689 1.6372 3.0525 2.9076 3.3077 1.9896 2.4624 2.0132 1.2631 1.3049 1.2678 1.2660 1.6717 1.4670 1.4427 1.6520 2.0509 2.4437 1.4105 1.6145 1.6070 1.3311 1.5719 1.4754 1.6241 1.5157 1.1853 1.1805 1.0510 1.0508 1.0509 1.0514 1.1014 5.7419 9.2214 10.0258 1.0296 1.0294 1.0836 1.0604 1.0862 1.0898 1.1043 1.1044 1.0910 1.1065 1.1049 1.1047 1.0874 1.1098
irintensity: 1.0733 0.5801 1.0267 0.8648 2.2004 0.1139 1.8787 2.7204 1.8780 2.4075 13.4300 8.7175 5.6256 4.1412 13.9540 4.0574 1.9980 8.5321 3.9540 10.6247 2.4932 8.8084 53.5716 5.5041 8.5228 2.9189 8.1286 21.1101 5.1525 3.8421 5.9151 4.5635 2.1729 4.1180 19.3879 33.4462 6.1370 33.2344 57.4207 9.4476 49.7723 0.9134 0.0432 101.7252 24.3912 4.5539 22.7558 33.4228 183.0982 31.4708 27.1879 10.0972 1.7331 1.5573 14.6732 20.7559 21.0597 13.0012 28.4958 2.7299 20.1147 15.7918 4.9277 19.3550 2.1425 170.2040 202.9200 25.7706 40.5471 10.9066 24.1429 8.2764 27.0380 40.3408 15.4655 9.5501 15.4119 7.4059 18.2940 5.3115 21.8729
temp: 298.150 k
press: 1.00000 atm
elementType: 8 8 8 8 6 6 6 6 6 6 6 6 6 6 6 1 1 1 1 1 1 1 1 1 1 1 1 1 1
symmnumber: 1
zpe: 608453.7 jmol-1
zpe.correction: 0.231748 hartree
zpe.thermalcorrener: 0.246518 hartree
zpe.thermalcorrenthalpy: 0.247462 hartree
zpe.thermalcorrgfe: 0.189195 hartree
zpe.sumelectzpe: -727.287142 hartree
zpe.sumelectthermal: -727.272372 hartree
zpe.sumelectthermalent: -727.271427 hartree
zpe.sumelectthermalfe: -727.329694 hartree
dipole: -0.5739 -0.2802 0.2873
dipole: 0.7003
quadrupole: -74.0243 -89.7859 -92.2212
quadrupole: 1.2974 -4.8637 11.0606
quadrupole: 11.3195 -4.4421 -6.8774 1.2974 -4.8637 11.0606
hfenergy: -727.5188893 hartree
pointgroup: C01 [X(C11H14O4)]
dipole: -0.2227539 -0.1126985 0.116553 debye
polarizability: 141.9889352|-3.7356498|119.1611698|-3.8332564|-5.2955496|104.4251125 unknown
InChI: InChI=1S/C11H14O4/c1-14-10(12)8-6-3-4-7(5-6)9(8)11(13)15-2/h3-4,6-9H,5H2,1-2H3
charge 0 multiplicity 1
29 atoms
O  -1.847346 -1.205478 -0.872865
O  -1.160933 1.217269 0.907962
O  -0.958559 -2.049259 1.106851
O  -1.14716 2.409012 -1.087224
C  1.733064 -1.198719 0.40219
C  1.837744 1.065206 0.203777
C  0.50191 -0.882388 -0.533698
C  0.577391 0.695931 -0.712548
C  1.686807 0.030532 1.360481
C  2.984018 -0.870416 -0.422731
C  3.048976 0.488538 -0.540201
C  -0.803925 -1.428231 0.032887
C  -0.65423 1.514961 -0.362017
C  -3.178338 -1.704799 -0.453711
C  -2.34472 2.002861 1.329414
H  1.681785 -2.194704 0.862346
H  1.886848 2.131328 0.470659
H  0.623275 -1.346038 -1.529328
H  0.793469 0.946951 -1.76267
H  0.739092 0.118223 1.913756
H  2.543602 0.053681 2.053725
H  3.635902 -1.611595 -0.892974
H  3.75824 1.077893 -1.127354
H  -3.855527 -1.419523 -1.270792
H  -3.478735 -1.235847 0.498744
H  -3.151372 -2.799791 -0.322648
H  -2.086053 3.072748 1.399799
H  -2.616204 1.594165 2.312866
H  -3.163924 1.878292 0.601108
