program: Gaussian 09
title: 000240304
version: EM64L-G09RevD.01
frameworkgroup: C1[X(C9H8N2)]
method: RPBEPBE
basis: SDD
operation: Freq
keyword: #p
keyword: freq=noraman
keyword: PBEPBE/SDD
title: #p freq=noraman PBEPBE/SDD
converged: YES YES NO YES
title: Mulliken charges:
elementType: N N C C C C C C C C C H H H H H H H H
charge: 0.000709 -0.003128 -0.249362 -0.228858 -0.526958 -0.193225 -0.184648 -0.203459 -0.205502 -0.192500 -0.185570 0.275769 0.272896 0.268100 0.245244 0.303156 0.298360 0.254459 0.254518
chargesum: 0.00000
title: Mulliken charges with hydrogens summed into heavy atoms:
elementType: N N C C C C C C C C C
charge: 0.000709 -0.003128 0.026407 0.044038 -0.013615 0.109930 0.113712 0.051000 0.049016 -0.192500 -0.185570
polarizability: 1.12522223e+02 -2.90810095e+00 9.12089650e+01 3.05458503e+00 1.19128287e+00 7.62247145e+01
1716.lowfreq: -19.3910 -9.9852 -0.0005 -0.0004 0.0000 13.3880 75.5185 121.1664 134.4465
frequency: 75.3915 121.1307 134.4338 167.8760 289.0894 345.2560 419.7125 443.8870 475.4496 482.4799 538.1516 558.2589 661.0763 730.3915 762.1081 800.1130 838.4990 890.5296 902.0667 917.0307 919.3910 934.4291 980.3865 989.9468 1000.4392 1023.2785 1040.0662 1094.3416 1112.2247 1147.6654 1164.8885 1200.1971 1234.3576 1250.1439 1264.7585 1266.2162 1289.5266 1318.0062 1329.8211 1473.6137 1583.7120 2186.9074 2193.5496 3021.8995 3026.4906 3049.4648 3101.9757 3105.5718 3110.6279 3170.7718 3202.2213
redmass: 6.4344 6.3868 6.3486 5.8870 6.5297 3.9162 5.8950 2.5086 7.8243 5.4406 3.8930 4.4023 3.4609 1.7257 5.4563 4.3879 3.0866 3.2966 2.4049 3.0996 2.7296 1.4467 2.4175 1.9178 2.4573 2.1863 2.1750 1.1992 1.1268 1.3870 1.3867 1.4988 1.3239 1.4186 1.3846 1.3472 1.5226 1.4962 1.6609 1.1008 5.7763 12.5476 12.5507 1.0670 1.0792 1.0849 1.0895 1.1000 1.0970 1.0883 1.1096
irintensity: 6.1503 1.3436 5.4720 4.5879 0.5979 1.3525 0.6048 1.5432 0.1939 0.6802 0.4011 3.2666 4.9788 58.9790 1.5275 10.2806 8.4281 3.9127 3.0687 2.2099 8.1872 1.5058 0.5901 0.5886 1.1847 2.6260 6.9851 3.2008 1.3786 1.8276 4.5297 6.1487 3.3568 2.7667 0.5639 1.5010 1.6627 5.5575 10.1818 11.6713 0.4112 15.0713 16.6499 16.5402 10.9486 1.9314 29.1354 14.6051 11.6187 2.2572 8.3256
temp: 298.150 k
press: 1.00000 atm
elementType: 7 7 6 6 6 6 6 6 6 6 6 1 1 1 1 1 1 1 1
symmnumber: 1
zpe: 384837.6 jmol-1
zpe.correction: 0.146577 hartree
zpe.thermalcorrener: 0.155499 hartree
zpe.thermalcorrenthalpy: 0.156443 hartree
zpe.thermalcorrgfe: 0.112327 hartree
zpe.sumelectzpe: -456.414087 hartree
zpe.sumelectthermal: -456.405164 hartree
zpe.sumelectthermalent: -456.404220 hartree
zpe.sumelectthermalfe: -456.448337 hartree
dipole: -1.3263 -4.2940 0.5507
dipole: 4.5278
quadrupole: -81.8680 -72.5666 -58.2999
quadrupole: 2.7950 -2.7174 2.6401
quadrupole: -10.9565 -1.6551 12.6116 2.7950 -2.7174 2.6401
hfenergy: -456.5606637 hartree
pointgroup: C01 [X(C9H8N2)]
dipole: 0.5543752 -1.6780511 -0.2237892 debye
dipolederiv: -0.3623056 0.0631477 0.0364573 0.0083297 -0.2142734 -0.0094709 -0.0381269 0.0084218 -0.210122 -0.2460321 -0.1020277 0.0137358 -0.0371805 -0.3052313 0.0189231 -0.0231717 -0.0376982 -0.2096472 0.0595064 -0.0249302 -0.0886543 -0.0415568 0.2437837 -0.0230488 -0.0521926 0.0238599 0.0165579 -0.0432648 -0.1108685 -0.1065018 -0.0578805 0.1918714 0.0458829 -0.0747989 -0.0043373 0.1687395 0.0336021 -0.0180178 0.0965388 -0.0647802 0.0069372 0.005089 0.0765988 -0.0014671 -0.0022528 -0.00254 0.0431483 0.0058532 0.0480944 0.0872311 -0.0024804 -0.0748243 -0.018666 0.154897 0.1104046 -0.0199926 -0.0271582 -0.0102543 0.0318886 -0.0189877 -0.0496813 -0.0114335 0.1172587 0.0472044 -0.0380756 0.0789516 -0.0153556 -0.2759132 -0.051463 0.0342781 -0.0936494 0.0144814 -0.002488 0.0382404 0.0463359 0.0610698 -0.1707851 -0.1452264 0.0960606 -0.1298462 -0.048079 0.2918002 -0.1276538 0.0204877 -0.0125916 -0.1056544 0.0006453 0.1004398 -0.0052048 -0.0719192 0.0389901 0.2331945 0.0519754 0.1371789 0.1191819 0.0138554 0.1087981 0.0843717 -0.0606436 -0.040384 -0.0620168 0.0704814 -0.0720419 0.0096573 0.0363662 0.0602264 0.0368857 0.0438791 0.0108853 0.0023363 0.0869582 -0.0005341 0.0453082 0.0315401 0.0913268 0.0244779 -0.0655575 0.0584646 0.0453696 0.02061 0.0244067 -0.1202506 -0.0681867 0.0162748 -0.0341712 0.0677322 -0.0397746 0.0315654 -0.1209253 0.0649379 0.0748328 0.0636525 -0.1088803 0.0359302 -0.0025427 0.0336097 0.0137462 -0.0286365 0.0076215 0.0550478 -0.0426305 -0.0079548 -0.0519617 0.0001909 0.0403736 0.0182019 -0.07862 -0.0080006 -0.0022619 0.0509345 -0.0604108 0.0324392 0.0290471 0.0633899 0.0176152 -0.0350148 0.0124005 0.1638738 0.062239 -0.0480719 0.0922455 -0.0393735 -0.0514417 -0.0029827 -0.0428743 -0.0438633 0.1647561 0.0323663 -0.0458899 0.0498035 0.0973538 unknown
polarizability: 112.3061671|3.2574544|91.3352569|3.6910948|-0.9412996|76.3144781 unknown
InChI: InChI=1S/C9H8N2/c10-4-8-6-1-2-7(3-6)9(8)5-11/h1-2,6-9H,3H2
charge 0 multiplicity 1
19 atoms
N  -3.273188 0.823608 -0.101999
N  1.961627 2.521577 0.340136
C  -0.546437 -1.424031 0.47347
C  0.999323 -0.676372 -1.02633
C  -0.235014 -1.629165 -1.039665
C  -0.767983 0.159191 0.513408
C  0.280737 0.673195 -0.576861
C  0.836683 -1.654225 1.089364
C  1.762587 -1.203647 0.193906
C  -2.146636 0.53908 0.173063
C  1.200444 1.696548 -0.065706
H  -1.386131 -1.986448 0.90442
H  1.570974 -0.562078 -1.957864
H  0.043721 -2.668945 -1.271847
H  -1.050244 -1.3000 -1.708813
H  -0.526682 0.56042 1.512691
H  -0.262703 1.095923 -1.442021
H  1.012732 -2.018546 2.104179
H  2.84329 -1.127686 0.332168
