program: Gaussian 09
title: 000240298
version: EM64L-G09RevD.01
frameworkgroup: C1[X(C12H10N2O3)]
method: RPBEPBE
basis: SDD
operation: Freq
keyword: #p
keyword: freq=noraman
keyword: PBEPBE/SDD
title: #p freq=noraman PBEPBE/SDD
converged: YES YES NO NO
title: Mulliken charges:
elementType: O O O N N C C C C C C C C C C C C H H H H H H H H H H
charge: -0.212847 -0.223398 -0.191794 -0.119617 -0.223836 -0.386409 -0.423151 0.173721 -0.455432 0.192328 0.178990 0.135771 0.102351 -0.353704 -0.349703 -0.209853 -0.209081 0.261629 0.243719 0.240869 0.282321 0.253010 0.274794 0.268909 0.270764 0.239627 0.240021
chargesum: 0.00000
title: Mulliken charges with hydrogens summed into heavy atoms:
elementType: O O O N N C C C C C C C C C C C C
charge: -0.212847 -0.223398 -0.191794 -0.119617 -0.223836 0.118939 0.100039 0.173721 0.072372 0.192328 0.178990 0.135771 0.102351 -0.084795 -0.078939 0.029774 0.030940
polarizability: 2.09010210e+02 -6.22917118e+00 1.52875158e+02 -1.68734234e+01 6.56128619e-01 8.93182037e+01
1716.lowfreq: -7.2605 -0.0006 -0.0003 0.0009 4.8166 8.4206 38.0125 47.8104 53.8746
frequency: 37.9681 47.7978 53.8533 112.5485 122.5153 141.3855 164.3426 178.8989 201.8402 236.4609 262.0906 309.8578 334.2070 363.8809 412.1917 457.2396 500.0594 523.9671 559.2592 585.2384 613.6525 659.3769 680.3505 698.3636 708.8321 768.8551 787.9769 797.7656 812.7127 849.0168 892.1155 907.1521 929.5620 954.7407 969.0909 974.5024 1006.7588 1010.1931 1017.5586 1066.6882 1073.8811 1099.4537 1118.4603 1121.5941 1136.9139 1148.2585 1169.1106 1172.0476 1207.0815 1279.0325 1287.3976 1327.0263 1363.6567 1389.0633 1416.2330 1446.8991 1453.9413 1455.2398 1461.3701 1477.1939 1613.7874 1614.4643 1618.4168 1626.8641 1678.6880 3019.2392 3079.5782 3083.3862 3089.0922 3140.5120 3153.9626 3165.5215 3175.3988 3187.6648 3203.1292
redmass: 6.1109 6.0507 5.1806 3.9793 7.0325 5.1495 4.0962 6.6195 3.6403 4.9794 3.3146 8.3210 8.6272 4.1639 3.1624 4.8595 4.8455 7.1169 5.6187 5.9042 5.5796 4.8109 7.1983 5.9843 3.1866 4.2749 5.1740 1.8411 1.0464 5.4289 4.8690 1.4033 4.0232 2.8716 5.7281 1.4157 1.3493 1.1524 1.9863 2.4774 2.7776 1.3050 1.4408 1.5434 2.2884 1.5238 1.1901 1.9770 3.1264 1.4264 1.5102 1.7668 4.1017 4.4792 5.9854 1.2348 2.4710 2.2071 1.0778 1.2298 8.5772 8.3770 8.1148 11.0765 12.1032 1.0580 1.0497 1.1035 1.0583 1.0865 1.0906 1.0956 1.1004 1.1199 1.1183
irintensity: 3.1523 5.3176 0.2850 2.6469 2.8994 0.0049 7.8889 4.5477 12.2775 0.4491 2.8769 2.4979 22.8387 2.1887 2.6635 0.0588 25.7404 9.9619 7.1289 9.8335 17.9650 0.0517 0.4672 0.9764 68.8791 22.6794 0.3250 24.5042 14.3901 13.9440 6.0024 0.0172 2.4290 20.9158 7.0822 2.0102 0.0030 10.9086 0.3130 142.7522 9.3413 2.1611 0.1908 31.5042 40.1171 11.0994 12.7355 5.4373 32.7203 21.5192 10.6037 65.9292 193.0699 253.3052 5.1512 38.4582 11.3987 10.3141 5.8436 7.9092 79.7307 85.4448 170.9495 410.0083 73.3452 22.6354 17.6414 8.3850 31.1778 1.6636 5.1114 5.5526 20.1979 2.8422 15.7582
temp: 298.150 k
press: 1.00000 atm
elementType: 8 8 8 7 7 6 6 6 6 6 6 6 6 6 6 6 6 1 1 1 1 1 1 1 1 1 1
symmnumber: 1
zpe: 524947.9 jmol-1
zpe.correction: 0.199942 hartree
zpe.thermalcorrener: 0.214309 hartree
zpe.thermalcorrenthalpy: 0.215253 hartree
zpe.thermalcorrgfe: 0.157482 hartree
zpe.sumelectzpe: -797.236339 hartree
zpe.sumelectthermal: -797.221972 hartree
zpe.sumelectthermalent: -797.221028 hartree
zpe.sumelectthermalfe: -797.278799 hartree
dipole: -1.6595 -3.2428 -2.2111
dipole: 4.2612
quadrupole: -68.1450 -103.3511 -102.0442
quadrupole: 0.1392 -8.0571 -3.8160
quadrupole: 23.0351 -12.1710 -10.8641 0.1392 -8.0571 -3.8160
hfenergy: -797.4362807 hartree
pointgroup: C01 [X(C12H10N2O3)]
dipole: 0.6868296 1.5056298 -0.2683315 debye
polarizability: 208.9425413|-13.9057365|142.7452177|10.1410224|24.0074457|99.5158128 unknown
InChI: InChI=1S/C12H10N2O3/c15-10(13-5-6-13)7-14-11(16)8-3-1-2-4-9(8)12(14)17/h1-4H,5-7H2
charge 0 multiplicity 1
27 atoms
O  -2.251384 -1.489687 1.262943
O  -0.694902 1.662506 0.282788
O  0.707168 -2.48036 -1.452618
N  -3.794354 -0.158751 0.10497
N  -0.309671 -0.468353 -0.686461
C  -4.536937 0.547716 1.167065
C  -4.057649 1.294681 -0.091793
C  -2.575924 -0.823308 0.242846
C  -1.69685 -0.774838 -1.02751
C  1.560837 0.592639 0.197209
C  1.980393 -0.658819 -0.319316
C  0.086677 0.7237 -0.023574
C  0.787243 -1.362907 -0.890792
C  2.468056 1.477732 0.797821
C  3.320439 -1.066332 -0.251364
C  3.827248 1.07455 0.871723
C  4.246796 -0.177807 0.355614
H  -4.00137 0.723754 2.106812
H  -5.595266 0.287732 1.266155
H  -4.78567 1.551724 -0.868088
H  -3.196617 1.964375 0.015705
H  -2.092731 -0.038416 -1.747475
H  -1.69617 -1.77464 -1.499024
H  2.133236 2.440882 1.195362
H  3.632125 -2.036212 -0.65127
H  4.564554 1.738426 1.335545
H  5.301825 -0.462488 0.428924
