program: Gaussian 09
title: 000241764
version: EM64L-G09RevD.01
frameworkgroup: C1[X(C23H32O5)]
method: RPBEPBE
basis: SDD
operation: Freq
keyword: #pfreq=noraman
keyword: PBEPBE/SDD
title: #p freq=noraman PBEPBE/SDD
converged: YES YES NO NO
title: Mulliken charges:
elementType: O O O O O C C C C C C C C C C C C C C C C C C C C C C C H H H H H H H H H H H H H H H H H H H H H H H H H H H H H H H H
charge: -0.282159 -0.273705 -0.233680 -0.243305 -0.249874 -0.126273 0.397331 -0.145570 -0.190111 0.217230 -0.583653 -0.116028 -0.124936 -0.543787 -0.490481 -0.488214 0.512631 -0.811249 -0.630235 -0.472594 -0.809427 -0.554380 -0.559934 0.173968 0.292829 0.275495 -0.772455 -0.760168 0.221127 0.229856 0.244727 0.237860 0.250013 0.272455 0.274065 0.218539 0.229300 0.231342 0.225851 0.242690 0.222941 0.238519 0.219877 0.229680 0.226629 0.227469 0.222629 0.208990 0.231051 0.232261 0.220424 0.249211 0.235437 0.252467 0.251984 0.254594 0.247017 0.248171 0.247182 0.248375
chargesum: 0.00000
title: Mulliken charges with hydrogens summed into heavy atoms:
elementType: O O O O O C C C C C C C C C C C C C C C C C C C C C C C
charge: -0.282159 -0.273705 -0.233680 -0.243305 -0.249874 0.094854 0.397331 0.084286 0.054616 0.217230 -0.095780 0.156427 0.149129 -0.095948 -0.033288 -0.022583 0.512631 -0.123172 -0.176137 -0.040975 -0.125691 -0.069732 -0.307467 0.173968 0.292829 0.275495 -0.018860 -0.016440
polarizability: 2.99077759e+02 -1.47151114e+00 2.61094452e+02 2.49561218e+01 -7.31453571e+00 2.07461535e+02
1716.lowfreq: -9.1971 -2.8423 -0.0008 -0.0007 0.0007 7.8680 17.7131 25.3247 31.7130
frequency: 17.4568 25.2367 31.6965 38.0792 42.2672 49.6438 55.3058 63.2035 68.2300 81.1896 97.0161 133.3015 146.5352 158.1848 177.0253 181.0816 197.4362 201.3603 203.8901 212.5227 234.6094 248.5184 274.3700 280.4983 287.1726 307.6098 322.5448 329.2205 345.4607 364.6916 366.9730 400.2813 410.1633 423.2371 443.5037 453.4164 472.6473 491.9846 493.4242 525.2711 546.5507 552.5158 562.5860 575.2603 582.2671 599.9318 615.9779 626.9119 646.9527 666.1711 683.8210 722.5979 740.7580 767.5643 813.5275 817.7296 825.4809 839.2731 849.8016 866.8678 887.6205 902.7603 907.8539 916.4330 923.1849 929.0072 950.4698 968.0698 974.0600 982.0112 993.0222 995.9188 999.3520 1003.3864 1019.4662 1030.1737 1040.0513 1041.5129 1043.8031 1046.7962 1052.3675 1069.4411 1086.1059 1097.1653 1105.3300 1111.6600 1115.9351 1132.9297 1139.0805 1163.6542 1178.8008 1184.5933 1193.3011 1197.6993 1204.4908 1207.9107 1211.6717 1215.0758 1235.5608 1240.5799 1254.6873 1266.1431 1273.8550 1275.8259 1276.5362 1291.8008 1296.9137 1302.4469 1309.7396 1316.1039 1320.7385 1324.6777 1336.7985 1340.1374 1343.9431 1347.3569 1351.9413 1355.1573 1371.6415 1383.4541 1384.0241 1391.9777 1397.7865 1450.0469 1452.1941 1452.7980 1454.6930 1455.6302 1457.4207 1459.8684 1461.2061 1467.1867 1469.7309 1477.7843 1480.4261 1487.2279 1490.4237 1491.8228 1585.2321 1624.4343 1641.4233 1647.5354 2918.0875 2956.7619 2968.6654 2979.4477 2984.5330 2987.9346 2989.4538 2990.4058 2990.7896 2994.9381 2997.3603 3004.5029 3007.4014 3015.9010 3022.2348 3031.5154 3039.2916 3055.3596 3057.0573 3058.9096 3061.4058 3071.0633 3083.7065 3087.4396 3089.0473 3090.2476 3094.8871 3095.1552 3096.3999 3117.1075 3138.4637 3142.8778
redmass: 6.1278 5.8691 1.3750 6.6025 3.3037 1.5404 2.3968 2.8211 2.7727 2.8173 3.3438 4.2985 1.8953 3.8726 2.9379 2.0247 1.3335 2.4602 2.9454 2.7747 3.1286 3.6543 3.1699 3.0791 3.7806 2.6343 3.0285 3.4877 3.0331 2.8550 2.9719 2.8414 3.5833 2.9085 3.3119 3.4698 3.7287 3.5226 3.4044 3.0167 3.3042 2.8469 3.0980 2.6910 2.9829 3.5298 4.1521 4.5851 3.6070 3.5020 3.4413 2.6915 2.4227 2.3448 2.5987 2.5768 3.0931 2.0510 2.3486 3.1237 1.5585 1.8493 2.2888 1.9862 3.3747 2.4565 2.0996 2.3384 2.6869 1.7478 1.8880 1.9350 2.1455 2.3798 2.3836 1.9757 1.6691 1.6769 1.9258 2.3636 2.2702 2.7300 2.0899 1.8019 2.8824 2.1313 2.0183 1.9717 1.7610 2.0916 1.8193 1.8468 1.6682 3.2902 3.2580 1.6975 1.7854 1.2440 1.6430 1.6825 1.3884 1.5201 1.3470 1.2885 1.9637 1.6263 1.3600 1.3375 1.2974 1.3241 1.4844 1.4728 1.5267 1.4739 1.7005 1.4494 1.4798 1.4940 1.4197 1.2482 1.2433 1.2078 1.2145 1.0755 1.0645 1.0579 1.0614 1.0483 1.0821 1.0821 1.0894 1.0718 1.0878 1.0719 1.0630 1.0642 1.0683 1.0767 9.9524 7.7055 9.4034 9.3001 1.0812 1.0809 1.0632 1.0695 1.0584 1.0619 1.0595 1.0605 1.0607 1.0487 1.0521 1.0378 1.0371 1.0838 1.0638 1.0851 1.0986 1.1024 1.1008 1.1008 1.0974 1.0986 1.1026 1.0983 1.0997 1.0902 1.0957 1.0970 1.0967 1.0911 1.1016 1.1012
irintensity: 1.8649 0.9921 1.5116 0.7492 0.2737 3.2142 3.2111 1.2350 1.7457 0.3997 0.7625 0.1957 0.4583 4.7332 3.8388 1.0995 0.1227 3.5300 0.9154 7.0500 0.2345 0.1004 4.7337 0.9894 2.1360 1.3017 1.8522 3.0505 1.5314 0.6249 1.2173 2.8672 2.6370 1.0539 2.0901 0.6011 5.5437 1.3861 1.6547 3.7979 7.9927 1.0851 3.2582 8.2750 7.3682 1.9240 4.3266 4.5958 1.8694 0.4240 6.6947 4.8536 4.6235 10.8699 3.3469 5.1283 1.7025 5.3280 5.7960 5.7158 27.1955 8.3895 17.8734 9.6800 63.6958 17.0380 3.6575 6.6129 17.0792 16.2664 0.9043 59.4985 123.2120 74.3462 0.3206 7.8452 8.6630 8.2486 7.1545 14.2659 11.5204 5.5496 2.8659 3.5564 11.8240 1.5495 2.5582 11.6295 4.0677 2.0944 5.9613 18.9107 55.8932 115.3685 506.5013 28.1598 3.8819 1.7751 49.4837 4.0263 0.2865 1.8418 5.2817 6.5382 28.0121 1.0001 0.8252 4.8190 2.5820 1.3915 9.9386 5.2748 8.8825 0.7279 2.4895 0.0305 2.3819 3.8948 2.6359 55.2931 58.4381 13.1957 34.0910 8.4255 26.4366 11.8807 20.5488 19.5141 5.6571 2.9138 12.3471 7.9585 33.9019 1.6465 12.2512 1.4995 2.4176 14.9753 182.3090 178.6215 162.4697 161.0888 12.5670 5.1222 22.7123 18.4106 0.5961 17.3528 8.1041 1.7049 73.1202 17.4558 37.4176 2.0312 2.3297 10.2319 31.6815 11.4126 51.0396 30.0297 8.9038 21.6915 20.5109 21.2494 50.4442 32.7237 21.7151 32.7301 3.0033 37.5709 8.1983 10.6538 9.7315 9.8227
temp: 298.150 k
press: 1.00000 atm
elementType: 8 8 8 8 8 6 6 6 6 6 6 6 6 6 6 6 6 6 6 6 6 6 6 6 6 6 6 6 1 1 1 1 1 1 1 1 1 1 1 1 1 1 1 1 1 1 1 1 1 1 1 1 1 1 1 1 1 1 1 1
symmnumber: 1
zpe: 1330823.0 jmol-1
zpe.correction: 0.506884 hartree
zpe.thermalcorrener: 0.535145 hartree
zpe.thermalcorrenthalpy: 0.536089 hartree
zpe.thermalcorrgfe: 0.446369 hartree
zpe.sumelectzpe: -1269.638042 hartree
zpe.sumelectthermal: -1269.609781 hartree
zpe.sumelectthermalent: -1269.608837 hartree
zpe.sumelectthermalfe: -1269.698557 hartree
dipole: 4.1566 -3.0547 2.5594
dipole: 5.7584
quadrupole: -192.7487 -158.1993 -178.0159
quadrupole: -3.5322 -12.1852 -2.8207
quadrupole: -16.4274 18.1220 -1.6946 -3.5322 -12.1852 -2.8207
hfenergy: -1270.1449255 hartree
pointgroup: C01 [X(C23H32O5)]
dipole: 1.6228205 -1.0876179 1.1472064 debye
polarizability: 298.0510072|1.4583507|259.2696614|26.8131266|-11.961754|210.3130772 unknown
InChI: InChI=1S/C23H32O5/c1-13(24)27-19-12-23(4)18(7-8-20(23)28-14(2)25)17-6-5-15-11-16(26)9-10-22(15,3)21(17)19/h11,17-21H,5-10,12H2,1-4H3
charge 0 multiplicity 1
60 atoms
O  -0.587273 2.140243 -0.427199
O  4.562451 -0.383506 0.030377
O  -5.59901 0.025832 -2.114212
O  0.304991 3.609424 1.154896
O  4.504449 1.247094 -1.6478
C  1.074794 -1.706056 -0.168375
C  2.025559 -0.55178 0.279358
C  -0.315094 -1.602974 0.486231
C  -0.994129 -0.232971 0.097318
C  -2.427671 -0.116848 0.79624
C  1.404117 0.774712 -0.19855
C  -0.036484 0.965134 0.341705
C  3.306741 -0.999619 -0.482373
C  1.91851 -2.993657 0.036715
C  -1.212719 -2.803195 0.098149
C  3.385709 -2.538306 -0.27754
C  -3.204659 -1.347141 0.293882
C  2.295377 -0.519808 1.806477
C  -2.644729 -2.692775 0.69854
C  -3.238843 1.169949 0.450393
C  -2.304996 -0.133775 2.351713
C  -3.770377 1.219162 -0.993312
C  -4.229506 -1.257622 -0.615009
C  -4.632404 -0.005413 -1.291545
C  -0.300656 3.415266 0.075212
C  5.059151 0.740637 -0.646496
C  -0.811593 4.482336 -0.86737
C  6.331475 1.226177 0.013759
H  0.927523 -1.583309 -1.266775
H  -0.172606 -1.635983 1.584941
H  -1.168901 -0.271136 -1.000414
H  1.36087 0.784945 -1.305189
H  2.010186 1.644566 0.113746
H  -0.008584 1.257727 1.40721
H  3.212892 -0.724245 -1.550107
H  1.591003 -3.815273 -0.623359
H  1.831787 -3.358805 1.077543
H  -0.741386 -3.743906 0.440158
H  -1.292569 -2.8589 -1.006836
H  4.070753 -2.759352 0.559386
H  3.794382 -3.035912 -1.173553
H  3.036399 0.265017 2.037145
H  1.3825 -0.292752 2.383284
H  2.702304 -1.475877 2.178961
H  -2.585792 -2.795979 1.799164
H  -3.279753 -3.513558 0.319796
H  -2.638969 2.066677 0.66794
H  -4.108201 1.195575 1.139183
H  -1.863701 0.815469 2.707669
H  -3.307965 -0.220711 2.807783
H  -1.689774 -0.959368 2.744433
H  -2.926889 1.243104 -1.712402
H  -4.372371 2.12727 -1.175568
H  -4.759901 -2.162236 -0.941146
H  -1.784462 4.195327 -1.29838
H  -0.099568 4.603092 -1.704226
H  -0.894006 5.441377 -0.334944
H  6.104395 1.62313 1.019253
H  6.785919 2.019986 -0.596146
H  7.041203 0.391916 0.142368
