program: Gaussian 09
title: 000240255
version: EM64L-G09RevD.01
frameworkgroup: C1[X(C15H24N2O)]
method: RPBEPBE
basis: SDD
operation: Freq
keyword: #p
keyword: freq=noraman
keyword: PBEPBE/SDD
title: #p freq=noraman PBEPBE/SDD
converged: YES YES NO NO
title: Mulliken charges:
elementType: O N N C C C C C C C C C C C C C C C H H H H H H H H H H H H H H H H H H H H H H H H
charge: -0.287767 -0.122258 -0.651876 -0.034461 -0.398880 -0.389261 -0.360835 -0.370407 -0.358976 -0.721709 -0.697734 0.236674 0.192407 -0.383261 -0.317976 -0.208193 -0.220431 -0.262438 0.180726 0.178146 0.230539 0.212341 0.218316 0.178182 0.199178 0.231175 0.208346 0.193641 0.203460 0.205655 0.223007 0.222611 0.217534 0.210172 0.208018 0.332433 0.338567 0.246318 0.262261 0.219787 0.215826 0.221141
chargesum: 0.00000
title: Mulliken charges with hydrogens summed into heavy atoms:
elementType: O N N C C C C C C C C C C C C C C C
charge: -0.287767 -0.122258 0.019124 0.146265 0.009804 0.041396 0.016524 0.069114 0.038125 -0.070436 -0.062010 0.236674 0.192407 -0.136942 -0.055715 0.011594 -0.004605 -0.041297
polarizability: 2.10592206e+02 -3.23852828e+01 2.12247283e+02 1.12499676e+01 2.64785563e+01 1.44643269e+02
1716.lowfreq: -18.6470 -9.7840 -3.6888 -0.0007 -0.0003 0.0004 7.5031 15.6946 24.2382
frequency: -2.6492 12.7966 24.0479 34.9659 47.5476 65.4896 70.3973 93.2805 109.9864 123.7304 138.9382 168.5600 216.2655 227.9841 232.7799 257.9995 268.4987 302.0065 316.7739 325.2451 336.1912 364.5261 412.4081 420.7011 494.6521 505.0499 534.6016 540.8911 572.9097 609.7678 633.3961 657.8533 695.8007 725.6436 755.0396 764.0823 771.0286 779.6318 813.9290 840.8682 847.4520 894.4096 912.6490 917.8692 923.9791 941.6458 970.9535 984.3319 985.0218 996.4194 1017.7797 1019.7277 1034.5195 1049.3045 1055.6568 1075.5668 1078.9563 1080.8026 1115.0505 1125.2154 1165.3320 1173.2396 1179.9879 1207.3720 1220.6640 1241.7500 1259.3590 1265.3881 1274.5695 1288.8446 1290.9758 1306.6163 1310.9304 1314.5372 1342.8805 1347.7157 1358.6004 1367.8692 1372.8874 1389.1344 1392.3899 1437.7743 1460.7119 1464.1921 1467.7366 1470.5743 1477.0010 1477.4036 1477.5522 1478.3623 1487.1699 1494.0645 1571.1795 1592.5824 1605.7884 1688.1262 2935.3219 2952.7374 2958.3448 2959.9142 2968.4049 2971.5229 2974.3722 2991.6176 2999.6297 3019.5004 3022.8744 3040.7257 3041.9719 3067.8880 3069.7847 3071.6314 3076.0505 3116.8517 3126.8998 3148.8475 3162.6369 3181.8426 3558.2411 3708.9883
redmass: 3.6190 2.8419 2.5555 3.9863 2.1807 3.5379 2.5880 4.2403 3.9416 2.4941 2.3395 3.2421 2.6313 1.3853 1.2271 3.6609 3.2621 2.2008 1.4476 3.5487 2.0571 4.0363 2.9306 2.5453 2.6464 1.8118 1.7960 2.7369 3.3292 5.6217 6.3737 9.2404 1.8485 1.1015 3.2340 1.6544 1.7920 1.3833 2.1813 1.2785 2.2132 1.8519 1.4854 1.5113 1.5905 3.3612 1.3623 2.5920 1.8239 2.1122 1.5328 2.1363 2.3384 2.6848 2.0423 1.5637 2.2132 1.9305 1.8791 1.9463 1.0562 2.1385 1.1290 1.3464 1.2411 1.2915 2.4012 1.2767 1.2517 1.1888 2.3716 1.2064 1.5074 1.3539 1.5640 1.5634 1.5785 5.3962 1.4243 1.2185 1.2202 2.4774 1.0717 1.0775 1.0699 1.0928 1.5233 1.0787 1.3010 1.0752 1.0830 1.0537 5.9171 1.2219 6.2027 7.8331 1.0768 1.0604 1.0620 1.0621 1.0603 1.0368 1.0368 1.0617 1.0925 1.1003 1.1059 1.1000 1.1017 1.1007 1.0994 1.0992 1.0999 1.0848 1.0893 1.0944 1.0984 1.0944 1.0444 1.1046
irintensity: 0.2002 0.0643 0.0623 0.1438 0.0493 0.6717 0.6141 2.2282 2.8496 0.1638 4.7683 0.3997 1.4294 0.3834 0.1749 5.1735 3.6355 32.6496 95.1549 3.1266 26.2575 0.7654 0.0376 0.3973 2.2202 36.9543 90.3213 26.7106 0.9269 9.1084 27.7008 17.3996 47.6729 7.2517 4.8486 2.0644 70.3979 10.0650 11.0886 1.2642 30.0133 6.3738 7.7847 36.3310 3.4148 161.2331 0.2155 1.9759 1.8474 51.8555 5.6865 9.8932 0.3090 3.5461 9.3416 12.4125 1.3339 4.1716 8.0787 4.7642 0.3035 4.2682 0.9624 2.1765 5.1138 15.7903 188.3251 2.8335 4.6945 10.2731 47.4656 0.9890 32.7112 3.1966 7.0044 3.1869 3.4491 5.0563 22.5633 11.5632 20.6642 1.1791 1.1574 1.4712 1.2853 8.9092 23.9069 5.6140 32.9043 1.3419 15.8395 13.1234 19.0280 98.6167 145.9691 1015.3628 10.7987 6.3648 58.1650 37.1772 79.1233 36.8984 38.7155 18.0279 6.7218 8.8923 33.4915 7.6903 60.4400 79.8974 65.6455 49.0405 70.7801 3.2469 20.2417 38.2623 26.8998 3.8367 75.5262 33.7600
temp: 298.150 k
press: 1.00000 atm
elementType: 8 7 7 6 6 6 6 6 6 6 6 6 6 6 6 6 6 6 1 1 1 1 1 1 1 1 1 1 1 1 1 1 1 1 1 1 1 1 1 1 1 1
symmnumber: 1
zpe: 951877.2 jmol-1
zpe.correction: 0.362551 hartree
zpe.thermalcorrener: 0.382189 hartree
zpe.thermalcorrenthalpy: 0.383133 hartree
zpe.thermalcorrgfe: 0.311635 hartree
zpe.sumelectzpe: -769.313949 hartree
zpe.sumelectthermal: -769.294310 hartree
zpe.sumelectthermalent: -769.293366 hartree
zpe.sumelectthermalfe: -769.364865 hartree
dipole: 3.6059 -3.2282 -0.8661
dipole: 4.9167
quadrupole: -114.6554 -95.2300 -109.6036
quadrupole: -2.0054 2.5923 8.0351
quadrupole: -8.1591 11.2663 -3.1073 -2.0054 2.5923 8.0351
hfenergy: -769.6764996 hartree
pointgroup: C01 [X(C15H24N2O1)]
dipole: 1.0432242 -1.5085283 -0.614742 debye
polarizability: 198.1148065|-27.7256143|219.8165696|9.6026864|34.7589334|149.5513815 unknown
InChI: InChI=1S/C15H24N2O/c1-3-5-9-13(4-2)12-18-15(16)17-14-10-7-6-8-11-14/h6-8,10-11,13H,3-5,9,12,16H2,1-2H3
charge 0 multiplicity 1
42 atoms
O  -0.507845 -1.284918 -0.290502
N  -2.70829 -0.384932 -0.611562
N  -2.128583 -2.39253 -1.637678
C  1.895049 -1.744844 -0.256152
C  2.282448 -0.340688 -0.799535
C  1.932838 -1.815648 1.295112
C  3.740479 0.080989 -0.507461
C  0.539741 -2.19381 -0.829573
C  4.125366 1.407466 -1.203458
C  1.631575 -3.210254 1.88682
C  5.574112 1.847611 -0.902797
C  -1.817533 -1.306895 -0.823133
C  -2.587479 0.809969 0.130994
C  -3.645854 1.750389 -0.037903
C  -1.53712 1.132058 1.045667
C  -3.652644 2.97247 0.663284
C  -1.556478 2.355904 1.7491
C  -2.60596 3.285846 1.563892
H  2.635482 -2.479886 -0.64798
H  2.130974 -0.333393 -1.900094
H  1.583319 0.412985 -0.387474
H  2.937298 -1.497309 1.631893
H  1.213185 -1.078885 1.70146
H  4.433324 -0.720741 -0.84178
H  3.897001 0.194937 0.583869
H  0.544953 -2.125474 -1.935712
H  0.311818 -3.235584 -0.522537
H  3.990337 1.296434 -2.298942
H  3.420789 2.202042 -0.88421
H  2.298025 -3.982785 1.456655
H  1.783643 -3.209856 2.981468
H  0.585852 -3.518378 1.704732
H  5.823821 2.794642 -1.415569
H  5.724862 2.001873 0.182473
H  6.29946 1.081186 -1.236103
H  -1.559587 -3.232687 -1.673974
H  -3.067203 -2.402984 -2.028711
H  -4.452364 1.489179 -0.730688
H  -0.722399 0.420333 1.198407
H  -4.476573 3.67956 0.511271
H  -0.743824 2.584305 2.449552
H  -2.611714 4.233707 2.113579
