program: Gaussian 09
title: 000240205
version: EM64L-G09RevD.01
frameworkgroup: C1[X(C12H22O3)]
method: RPBEPBE
basis: SDD
operation: Freq
keyword: #pfreq=noraman
keyword: PBEPBE/SDD
title: #p freq=noraman PBEPBE/SDD
converged: YES YES NO NO
title: Mulliken charges:
elementType: O O O C C C C C C C C C C C C H H H H H H H H H H H H H H H H H H H H H H
charge: -0.306008 -0.282764 -0.248606 0.257090 0.279182 -0.610708 0.396503 -0.712953 -0.724916 0.029130 -0.728149 -0.737593 -0.341704 -0.393325 -0.718109 0.227884 0.245399 0.214360 0.231264 0.222305 0.210770 0.251724 0.214982 0.183519 0.222554 0.229572 0.202879 0.252273 0.189717 0.229294 0.224860 0.200774 0.193584 0.230096 0.228761 0.203740 0.232618
chargesum: 0.00000
title: Mulliken charges with hydrogens summed into heavy atoms:
elementType: O O O C C C C C C C C C C C C
charge: -0.306008 -0.282764 -0.248606 0.257090 0.279182 -0.137426 0.396503 -0.045024 -0.047440 0.212649 -0.073143 -0.066309 0.081977 0.032309 -0.052990
polarizability: 1.49231025e+02 -2.89579751e-02 1.35823343e+02 1.10614746e+00 -5.46647282e-01 1.23831550e+02
1716.lowfreq: -8.2063 0.0006 0.0007 0.0012 1.1181 16.1897 61.4381 78.1120 106.6249
frequency: 61.0791 78.0591 106.5387 117.6079 178.8215 181.0100 191.9021 199.5511 209.8054 228.8477 244.1838 257.9679 270.7774 288.4471 306.2045 314.6519 335.3478 351.1239 393.8489 407.9278 422.3141 452.2558 460.8830 497.7951 520.3943 536.2400 561.8764 622.7210 721.5151 750.1108 782.1515 816.3363 833.8750 854.8723 883.6195 889.8507 914.6721 928.8655 942.6831 952.1959 956.3565 964.1259 972.8813 993.4659 1011.1071 1018.3439 1045.0066 1072.3202 1090.1187 1134.1351 1137.7960 1152.4919 1165.9770 1168.2663 1210.4856 1216.6295 1229.5396 1236.5594 1264.7639 1281.0688 1297.5894 1303.7906 1328.2079 1355.0705 1363.3941 1367.7971 1374.2034 1384.0650 1387.5254 1390.5254 1437.1941 1448.0789 1451.7891 1457.0721 1458.8766 1462.6215 1466.1004 1468.0418 1470.7011 1475.9787 1478.0896 1482.5687 1487.1429 2923.5278 2953.6558 2976.3106 2981.2184 2989.2949 2993.9876 2995.1656 3000.4469 3024.2946 3062.6140 3072.3523 3078.7337 3082.1597 3084.2918 3089.0845 3090.2200 3091.0351 3095.0504 3097.3315 3099.0810 3105.3597 3129.4889
redmass: 3.2757 3.2370 2.8815 2.8945 1.5702 1.2287 1.3325 1.2921 1.4752 1.5890 1.4731 1.2645 2.6836 2.3776 2.6067 2.8376 2.8304 2.6313 2.9076 3.0319 3.3879 2.5322 3.0046 2.7586 3.1931 2.8460 3.6335 3.6503 3.7369 4.3496 3.2289 2.7844 2.3992 3.0057 3.1227 3.3688 1.8213 1.5474 1.6440 1.9927 1.6588 1.8199 1.3918 1.2977 1.5932 2.4104 2.3116 2.8434 4.0423 2.1567 1.8845 1.9137 2.2221 2.1641 1.3802 2.9180 1.9421 1.6124 2.3811 2.9123 1.8811 1.2873 1.2292 1.3043 1.5725 1.2452 1.2357 1.2196 1.2447 1.2166 1.0943 1.0548 1.0549 1.0482 1.0484 1.0556 1.0702 1.0703 1.0783 1.0598 1.0598 1.0579 1.0555 1.0831 1.0683 1.0359 1.0361 1.0384 1.0576 1.0350 1.0364 1.0598 1.1008 1.0982 1.0999 1.0981 1.1009 1.0993 1.1002 1.1001 1.0996 1.1003 1.1005 1.0998 1.0988
irintensity: 1.0227 0.7758 2.3592 1.0791 1.2062 0.6058 0.1202 1.7086 0.5304 0.3640 0.8072 0.2611 0.5397 0.9843 2.6493 2.9512 2.2092 0.8134 0.9696 4.0741 1.6443 5.2027 5.0368 8.7870 1.5997 4.7375 1.4837 2.4369 3.2364 4.6325 9.5743 2.5323 9.7999 14.8520 41.6945 35.5492 21.5975 8.3628 15.7772 9.7717 2.3567 26.0343 6.9667 0.2354 11.2390 4.0374 39.6791 36.6912 141.4270 52.5958 89.5415 20.0392 59.6254 25.1783 10.7887 1.3034 7.2547 3.9421 17.3413 17.4355 48.6761 4.5125 14.0865 9.1674 8.5583 17.3309 36.1200 21.5484 26.9172 19.4258 8.3938 1.3698 2.3922 8.8641 2.4082 3.9964 14.2396 6.0826 0.7909 5.6373 20.7741 10.6191 14.3871 38.8267 57.4020 18.7482 38.6683 13.1548 45.4750 15.8157 23.0519 17.6544 26.3434 8.1439 23.1836 31.7020 38.3540 37.5580 20.6977 20.1963 37.2065 34.3941 26.0242 32.7789 16.8435
temp: 298.150 k
press: 1.00000 atm
elementType: 8 8 8 6 6 6 6 6 6 6 6 6 6 6 6 1 1 1 1 1 1 1 1 1 1 1 1 1 1 1 1 1 1 1 1 1 1
symmnumber: 1
zpe: 843376.2 jmol-1
zpe.correction: 0.321225 hartree
zpe.thermalcorrener: 0.337718 hartree
zpe.thermalcorrenthalpy: 0.338662 hartree
zpe.thermalcorrgfe: 0.279684 hartree
zpe.sumelectzpe: -694.913669 hartree
zpe.sumelectthermal: -694.897176 hartree
zpe.sumelectthermalent: -694.896231 hartree
zpe.sumelectthermalfe: -694.955210 hartree
dipole: 2.7644 1.2431 -2.7111
dipole: 4.0666
quadrupole: -87.8845 -92.3324 -92.0918
quadrupole: 0.9441 0.1783 -2.0546
quadrupole: 2.8851 -1.5629 -1.3222 0.9441 0.1783 -2.0546
hfenergy: -695.2348938 hartree
pointgroup: C01 [X(C12H22O3)]
dipole: -1.117327 -0.4714723 -1.0435818 debye
polarizability: 149.1602153|-0.1067918|135.8141699|-1.72563|0.6609018|123.9115318 unknown
InChI: InChI=1S/C12H22O3/c1-9-6-7-13-12(14-9)8-10(2,3)15-11(12,4)5/h9H,6-8H2,1-5H3
charge 0 multiplicity 1
37 atoms
O  2.028029 -0.057683 0.758918
O  -0.999847 -0.380092 0.721878
O  -0.893008 1.52495 -0.761173
C  -0.139723 0.425414 -0.157311
C  1.008606 1.03246 0.719257
C  0.618282 -0.459973 -1.183924
C  1.844205 -1.007819 -0.397224
C  1.6257 2.277965 0.044473
C  0.598942 1.332922 2.166044
C  -2.226605 -0.909523 0.068439
C  3.137754 -0.996341 -1.233122
C  1.580217 -2.397681 0.216144
C  -2.087194 1.057509 -1.494831
C  -3.012577 0.260286 -0.559048
C  -2.989831 -1.656172 1.162406
H  0.00413 -1.28085 -1.58903
H  0.943825 0.179631 -2.0236
H  1.904251 2.08165 -1.005145
H  0.918476 3.123887 0.057791
H  2.538713 2.555285 0.599387
H  -0.195935 2.099461 2.183806
H  0.225773 0.423395 2.658559
H  1.474096 1.712633 2.722091
H  -1.930259 -1.620885 -0.736147
H  3.35115 0.020255 -1.607761
H  3.992278 -1.319499 -0.612939
H  3.054928 -1.682855 -2.097044
H  0.63557 -2.38429 0.785326
H  1.525554 -3.176561 -0.568305
H  2.399892 -2.656616 0.90895
H  -3.382555 0.921333 0.246307
H  -3.884509 -0.125562 -1.122757
H  -1.777419 0.436708 -2.363244
H  -2.565711 1.976373 -1.869701
H  -3.255949 -0.964923 1.981056
H  -3.917495 -2.097978 0.754892
H  -2.368859 -2.465813 1.582981
