program: Gaussian 09
title: 000240195
version: EM64L-G09RevD.01
frameworkgroup: C1[X(C13H26O)]
method: RPBEPBE
basis: SDD
operation: Freq
keyword: #pfreq=noraman
keyword: PBEPBE/SDD
title: #p freq=noraman PBEPBE/SDD
converged: YES YES NO NO
title: Mulliken charges:
elementType: O C C C C C C C C C C C C C H H H H H H H H H H H H H H H H H H H H H H H H H H
charge: -0.461096 -0.010125 0.028259 -0.076408 -0.574124 -0.479939 -0.462990 -0.040570 -0.105439 -0.778949 -0.388744 -0.739746 -0.741537 -0.710989 0.210021 0.191716 0.211111 0.191240 0.203818 0.210528 0.200659 0.194321 0.200366 0.194833 0.186222 0.222455 0.215224 0.219832 0.204217 0.211870 0.210398 0.222114 0.208964 0.226773 0.207184 0.209047 0.330624 0.196911 0.253070 0.208877
chargesum: 0.00000
title: Mulliken charges with hydrogens summed into heavy atoms:
elementType: O C C C C C C C C C C C C C
charge: -0.130472 0.199896 0.219975 0.134704 -0.179067 -0.068752 -0.068302 0.154263 0.080782 -0.121438 0.027343 -0.098269 -0.098533 -0.052130
polarizability: 1.67175931e+02 -1.68421536e+00 1.39841471e+02 -4.21383552e-01 -6.22340978e-01 1.16950353e+02
1716.lowfreq: -12.2313 -9.9398 -0.0007 -0.0006 -0.0005 7.8071 44.4001 47.8322 67.7689
frequency: 44.1790 47.6676 67.3215 76.7721 99.4213 125.1373 176.9220 193.4391 195.8379 206.6045 222.3851 232.7189 243.0703 265.7289 283.9246 296.1045 322.4583 353.1492 368.8237 398.2721 419.5108 439.4834 454.7171 487.3080 500.9664 540.9864 627.8244 761.1934 772.2064 799.5204 827.1243 860.0194 876.1852 914.8710 916.8099 928.5680 934.7192 940.4852 955.6642 975.7662 998.1426 1014.6762 1034.3016 1058.9739 1062.6265 1077.2417 1093.4361 1100.1794 1106.4117 1124.7970 1152.0285 1158.5521 1171.0009 1177.5007 1219.0076 1222.3646 1229.5567 1244.7089 1269.8073 1282.4653 1291.3982 1305.5308 1309.6591 1313.1057 1324.0369 1329.4233 1330.9424 1337.4819 1349.2927 1357.8554 1362.1231 1374.1709 1379.0322 1388.1337 1395.6936 1396.3999 1451.9846 1457.4234 1460.7999 1468.3445 1469.9018 1470.5941 1477.6281 1483.0703 1485.6871 1487.1798 1489.2322 1495.1288 2921.1797 2925.4376 2942.6877 2948.1046 2956.3158 2958.0593 2966.3821 2969.0422 2972.5514 2975.9879 2977.7998 2981.0036 2987.1516 3018.4264 3020.1796 3036.8356 3041.5425 3057.3235 3064.7787 3064.8433 3067.0258 3072.3211 3073.6294 3080.3643 3100.9897 3574.1777
redmass: 2.6910 2.8619 2.2065 2.8229 2.9719 2.4355 1.7782 1.4887 1.3514 1.2102 1.4852 1.7418 1.7888 1.9900 1.4372 2.5641 2.7371 1.8979 2.6970 2.2649 2.6453 2.5082 2.6231 2.3361 3.0247 2.4210 2.2411 1.4975 2.2289 2.1036 1.9036 2.5689 1.9446 1.2887 1.7759 2.2545 1.7861 1.6972 1.4359 1.7003 1.6860 1.7630 2.7016 1.7576 1.6764 1.9051 1.8308 2.0351 1.7534 1.7318 2.2427 2.0853 1.7650 2.0273 1.4431 1.3773 1.3520 1.3317 1.2624 1.1555 1.2981 1.2301 1.3406 1.4703 1.3777 1.4135 1.4947 1.3895 1.3766 1.4350 1.4226 1.5147 1.2217 1.2877 1.2147 1.2081 1.0793 1.0803 1.0781 1.0539 1.0825 1.0509 1.0451 1.0557 1.0554 1.0539 1.0546 1.0468 1.0798 1.0814 1.0723 1.0815 1.0728 1.0661 1.0641 1.0367 1.0371 1.0475 1.0386 1.0644 1.0664 1.0962 1.0986 1.0984 1.0988 1.0989 1.0984 1.0983 1.0993 1.0989 1.0986 1.0978 1.0992 1.0657
irintensity: 0.1731 0.7067 0.5569 0.0440 0.0667 1.4708 0.3445 0.3956 0.0181 4.6677 0.0465 11.9104 22.8272 24.7569 105.7525 6.1610 1.8791 1.6229 0.3339 1.4733 9.4459 0.8121 2.5941 1.4805 0.6388 1.0623 6.1593 4.0147 1.2729 2.7678 2.4660 3.5258 1.4440 5.0737 4.3341 73.9417 5.2386 1.2330 0.3618 0.2406 7.6458 9.8607 2.0087 31.4355 8.7645 2.1396 5.0709 6.7350 4.6320 0.9748 5.9671 2.2073 9.3247 13.8992 2.9845 16.3467 4.7196 0.8946 1.3546 10.6283 2.4310 8.9737 3.0154 4.0504 1.6370 1.4228 0.7446 5.6246 1.4774 5.7262 5.9849 7.9903 19.5874 23.8233 31.5951 7.4705 4.3054 6.1377 10.3283 0.3571 1.1939 15.6604 3.4078 2.3484 6.2695 14.0662 13.6318 22.3209 5.5324 18.1291 14.0385 10.3901 66.4542 10.9728 38.4793 29.0305 36.3752 46.4501 59.8350 14.9304 59.5733 64.0322 40.4783 73.0111 25.1016 0.5074 72.0851 62.5505 70.9430 43.9609 47.7066 45.2436 29.1394 2.7491
temp: 298.150 k
press: 1.00000 atm
elementType: 8 6 6 6 6 6 6 6 6 6 6 6 6 6 1 1 1 1 1 1 1 1 1 1 1 1 1 1 1 1 1 1 1 1 1 1 1 1 1 1
symmnumber: 1
zpe: 956695.8 jmol-1
zpe.correction: 0.364386 hartree
zpe.thermalcorrener: 0.381523 hartree
zpe.thermalcorrenthalpy: 0.382468 hartree
zpe.thermalcorrgfe: 0.320393 hartree
zpe.sumelectzpe: -585.032186 hartree
zpe.sumelectthermal: -585.015048 hartree
zpe.sumelectthermalent: -585.014104 hartree
zpe.sumelectthermalfe: -585.076179 hartree
dipole: 1.4735 1.0656 0.8314
dipole: 1.9995
quadrupole: -95.3928 -92.0220 -89.9555
quadrupole: -5.3359 -1.2362 -2.6780
quadrupole: -2.9361 0.4348 2.5013 -5.3359 -1.2362 -2.6780
hfenergy: -585.3965717 hartree
pointgroup: C01 [X(C13H26O1)]
dipole: 0.5826735 -0.4143968 -0.3280429 debye
polarizability: 167.1585104|1.7823507|139.8629026|0.6560539|-0.4222183|116.9463421 unknown
InChI: InChI=1S/C13H26O/c1-5-13(14)12-8-11(9(2)3)7-6-10(12)4/h9-14H,5-8H2,1-4H3
charge 0 multiplicity 1
40 atoms
O  -2.143389 2.075268 0.193412
C  -0.832745 -0.050051 0.359262
C  1.771428 0.035504 0.296389
C  -0.807738 -1.596866 0.143409
C  0.435244 0.623756 -0.236042
C  1.775067 -1.505947 0.121643
C  0.514147 -2.163027 0.726982
C  3.013951 0.708112 -0.373769
C  -2.1310 0.634117 -0.16295
C  -1.016555 -2.032294 -1.329647
C  -3.427122 0.067785 0.443519
C  3.014039 2.249043 -0.207517
C  4.348482 0.137956 0.170225
C  -4.697597 0.739666 -0.117311
H  -0.811855 0.123554 1.458182
H  1.823808 0.25342 1.388406
H  -1.636088 -2.036241 0.735551
H  0.41093 1.70376 0.006173
H  0.420117 0.541487 -1.344784
H  2.669791 -1.942826 0.602714
H  1.848202 -1.749502 -0.959043
H  0.548965 -3.259769 0.570148
H  0.519365 -1.996723 1.82466
H  2.964224 0.481396 -1.462254
H  -2.171967 0.539641 -1.272751
H  -0.269268 -1.585013 -2.009454
H  -0.928336 -3.131559 -1.417534
H  -2.018113 -1.750699 -1.703227
H  -3.469284 -1.02161 0.255354
H  -3.380415 0.207963 1.541782
H  3.939377 2.683842 -0.629361
H  2.16155 2.72973 -0.718911
H  2.970762 2.527814 0.863818
H  4.469638 -0.936269 -0.052984
H  4.410009 0.26772 1.26868
H  5.208563 0.668979 -0.278611
H  -1.407524 2.53041 -0.286926
H  -4.787267 0.573238 -1.2082
H  -4.662968 1.827432 0.058816
H  -5.607029 0.332802 0.361951
