program: Gaussian 09
title: 000240198
version: EM64L-G09RevD.01
frameworkgroup: C1[X(C15H26O2)]
method: RPBEPBE
basis: SDD
operation: Freq
keyword: #pfreq=noraman
keyword: PBEPBE/SDD
title: #p freq=noraman PBEPBE/SDD
converged: YES YES NO NO
title: Mulliken charges:
elementType: O O C C C C C C C C C C C C C C C H H H H H H H H H H H H H H H H H H H H H H H H H H
charge: -0.221376 -0.205061 0.391610 -0.218724 -0.088075 -0.619348 -0.099525 -0.504154 -0.781622 -0.760706 -0.391831 -0.762843 -0.483437 -0.477622 0.207636 -0.064736 -0.774730 0.261313 0.241380 0.227231 0.214146 0.202581 0.234560 0.229744 0.218221 0.213277 0.216754 0.215874 0.219997 0.203540 0.231091 0.211156 0.206914 0.235584 0.216070 0.233877 0.209990 0.239299 0.241299 0.175325 0.225868 0.279112 0.250344
chargesum: 0.00000
title: Mulliken charges with hydrogens summed into heavy atoms:
elementType: O O C C C C C C C C C C C C C C C
charge: -0.221376 -0.205061 0.391610 0.042589 0.153305 -0.177971 0.103056 -0.039851 -0.133370 -0.121295 0.050416 -0.104275 -0.039570 0.002976 0.207636 0.110588 -0.019405
polarizability: 1.79138179e+02 -2.49008515e+00 1.69852233e+02 1.88749773e-01 -4.22813733e+00 1.37943293e+02
1716.lowfreq: -15.8371 -0.0006 -0.0005 -0.0003 2.4167 8.1028 18.5571 28.8424 48.1120
frequency: 18.3912 28.3648 48.0864 51.4573 65.1629 69.3374 78.2954 94.3504 112.6445 141.0424 166.3309 168.2222 181.7929 192.7163 218.2010 239.6065 250.8168 268.4015 291.1679 308.6210 327.2604 346.3211 373.4944 382.7968 394.5859 442.8416 485.2476 499.1635 517.4834 586.4469 601.9692 662.6514 681.4710 702.3455 746.1910 796.1484 829.6547 854.1710 872.0659 884.1751 897.8461 905.7165 925.6941 933.0888 956.3438 963.9877 971.8542 975.2642 995.4393 1008.4786 1022.2496 1052.6740 1062.0378 1079.3040 1106.4255 1111.1693 1124.0560 1133.6250 1141.4086 1174.7836 1178.2217 1190.5137 1206.2965 1210.3553 1237.8578 1241.9438 1250.6973 1262.2366 1266.9342 1278.5386 1294.0546 1305.2798 1322.4655 1326.9774 1335.9567 1357.8380 1367.8153 1375.9723 1376.6943 1378.8528 1386.5595 1393.5414 1424.0033 1444.1774 1452.7807 1456.6152 1459.9694 1461.4365 1465.5916 1467.2219 1473.3869 1476.8874 1480.8209 1481.5553 1487.9843 1619.0926 1636.1273 2865.2887 2930.6736 2942.9908 2961.3075 2963.0274 2966.0735 2967.5320 2973.2619 2979.3965 2982.1635 2988.6135 2993.1306 2995.8880 3000.8949 3037.6347 3053.4828 3054.3203 3056.4308 3059.2904 3059.6367 3060.3463 3064.6379 3066.8398 3069.7900 3071.5980 3115.2250
redmass: 6.1539 4.3126 4.8285 3.1678 2.9809 3.4714 4.0877 2.5741 1.5621 1.7263 2.5074 2.2096 2.2446 1.2428 1.2968 2.1526 2.8945 1.0885 2.8600 2.3636 2.3263 2.5031 2.4622 2.4189 2.0430 2.5630 2.6763 3.2945 2.3782 2.3265 2.6478 2.0718 1.6958 2.6797 3.4372 1.9340 1.4055 2.0423 2.2232 1.8603 2.0406 1.7604 1.9780 1.3933 1.4780 1.7211 1.5215 1.7423 2.0429 1.5572 2.2053 1.7648 1.9583 2.2956 2.4490 1.6372 2.1212 1.8059 1.5014 1.8516 1.5404 1.6264 1.6554 1.5839 1.4957 2.0068 1.4778 2.3157 1.3665 1.4525 1.4531 1.3666 1.4031 1.3518 1.5640 1.5603 1.5152 1.2308 1.2511 1.2371 1.2158 1.2082 1.1031 1.0814 1.0802 1.0903 1.0687 1.0669 1.0713 1.0747 1.0643 1.0587 1.0575 1.0490 1.0635 7.5409 7.4009 1.0843 1.0818 1.0665 1.0626 1.0498 1.0367 1.0418 1.0405 1.0676 1.0718 1.0683 1.0618 1.0611 1.0892 1.0991 1.0994 1.0973 1.1001 1.0986 1.0977 1.0935 1.1024 1.0989 1.1008 1.1016 1.1003
irintensity: 2.1738 1.6806 4.0044 7.0361 2.4009 3.2526 0.8506 3.4424 0.1524 1.6896 0.5950 2.1857 3.5241 1.6246 0.0363 0.3946 2.4356 0.1236 0.9290 0.0617 0.3266 1.0926 3.4546 0.4047 1.4698 0.2581 0.3350 9.8269 2.2255 0.6597 0.5067 7.4242 8.0801 3.6739 2.5282 1.6516 4.9345 0.3634 1.7531 1.2561 10.5963 13.5777 3.4120 1.0439 0.6304 1.2506 7.7202 3.1109 3.3451 4.4633 0.8844 5.0560 0.3035 1.8749 1.5497 1.2884 16.6232 1.6483 2.1167 4.5635 2.3068 5.1016 8.5137 1.7559 3.9558 71.6237 17.6099 5.1828 33.7889 6.2869 8.6725 9.6210 3.7516 5.5462 4.1738 2.7895 1.0680 16.0072 24.0787 52.7709 23.1406 11.1673 29.2902 4.7868 18.8321 10.2157 8.7088 16.3688 15.8199 5.9508 6.2412 6.8617 11.7267 9.0877 9.8365 99.2309 115.1137 170.6050 8.2832 33.2526 5.2589 34.6211 49.1962 21.5822 4.3357 14.8121 12.3289 36.9367 57.2479 18.9286 14.3332 34.2247 7.2638 18.3778 21.4240 29.3747 62.3302 34.4379 49.5466 42.1853 60.1332 36.8473 13.0975
temp: 298.150 k
press: 1.00000 atm
elementType: 8 8 6 6 6 6 6 6 6 6 6 6 6 6 6 6 6 1 1 1 1 1 1 1 1 1 1 1 1 1 1 1 1 1 1 1 1 1 1 1 1 1 1
symmnumber: 1
zpe: 984728.0 jmol-1
zpe.correction: 0.375063 hartree
zpe.thermalcorrener: 0.395872 hartree
zpe.thermalcorrenthalpy: 0.396816 hartree
zpe.thermalcorrgfe: 0.323919 hartree
zpe.sumelectzpe: -736.241386 hartree
zpe.sumelectthermal: -736.220577 hartree
zpe.sumelectthermalent: -736.219633 hartree
zpe.sumelectthermalfe: -736.292530 hartree
dipole: -1.1446 -3.2758 -1.8494
dipole: 3.9321
quadrupole: -101.6427 -109.6503 -109.0202
quadrupole: 6.9527 -7.3225 -8.1983
quadrupole: 5.1284 -2.8792 -2.2491 6.9527 -7.3225 -8.1983
hfenergy: -736.6164487 hartree
pointgroup: C01 [X(C15H26O2)]
dipole: 0.9414887 -1.0653679 0.6097438 debye
polarizability: 175.5956653|5.358804|172.4448117|-6.004558|3.5301841|138.8932284 unknown
InChI: InChI=1S/C15H26O2/c1-11(6-5-9-16)13-10-15(3,4)14(13)8-7-12(2)17/h9,11,13-14H,5-8,10H2,1-4H3
charge 0 multiplicity 1
43 atoms
O  -1.833088 2.507728 -1.325843
O  3.277559 2.400859 -0.162067
C  -2.144153 -1.584034 0.031719
C  -0.983134 -0.504115 0.187162
C  0.064138 -1.671484 0.288245
C  -1.024326 -2.655281 -0.26714
C  1.384821 -1.535733 -0.502355
C  -1.03336 0.542489 1.314584
C  -2.889067 -1.903969 1.34473
C  -3.143397 -1.324569 -1.110127
C  2.142623 -0.256454 -0.0680
C  2.241401 -2.816254 -0.359748
C  -1.945843 1.76945 0.992417
C  3.418921 0.045621 -0.872775
C  -1.375976 2.611244 -0.152363
C  3.90345 1.479931 -0.743307
C  -0.207908 3.539044 0.164125
H  -0.856751 0.011229 -0.786757
H  0.297927 -1.895424 1.350278
H  -1.135607 -3.629242 0.240653
H  -0.897332 -2.832221 -1.352209
H  1.11404 -1.415854 -1.575752
H  -0.008788 0.900423 1.537382
H  -1.400471 0.074993 2.247979
H  -2.191345 -2.139575 2.170318
H  -3.528396 -1.060234 1.668489
H  -3.543854 -2.784703 1.201853
H  -3.809484 -0.472272 -0.877188
H  -2.618659 -1.08269 -2.052483
H  -3.778514 -2.214117 -1.289796
H  1.468526 0.612936 -0.172455
H  2.396594 -0.322488 1.009582
H  2.575429 -2.948022 0.688053
H  1.658032 -3.711919 -0.641935
H  3.141476 -2.790437 -1.001784
H  -2.949997 1.41548 0.698355
H  -2.039693 2.392916 1.902256
H  3.252294 -0.130507 -1.960317
H  4.262196 -0.623606 -0.60389
H  4.890643 1.692127 -1.230705
H  -0.359559 4.067302 1.122471
H  0.736706 2.965657 0.256393
H  -0.075773 4.267777 -0.651449
