program: Gaussian 09
title: 000240169
version: EM64L-G09RevD.01
frameworkgroup: C1[X(C18H22N2O)]
method: RPBEPBE
basis: SDD
operation: Freq
keyword: #p
keyword: freq=noraman
keyword: PBEPBE/SDD
title: #p freq=noraman PBEPBE/SDD
converged: YES YES NO NO
title: Mulliken charges:
elementType: O N N C C C C C C C C C C C C C C C C C C H H H H H H H H H H H H H H H H H H H H H H
charge: -0.288581 -0.519819 -0.504912 -0.250920 0.630464 -0.518169 0.294042 0.252162 -0.517153 -0.696530 -0.696651 -0.389510 -0.854305 0.258990 0.479209 0.452229 -0.452910 -0.334487 -0.404538 -0.354691 -0.810839 0.203599 0.305317 0.234843 0.224309 0.208351 0.222824 0.222854 0.208341 0.224253 0.223760 0.311076 0.248922 0.224312 0.224380 0.286430 0.210953 0.305065 0.228684 0.227717 0.230071 0.220792 0.230065
chargesum: 0.00000
title: Mulliken charges with hydrogens summed into heavy atoms:
elementType: O N N C C C C C C C C C C C C C C C C C C
charge: -0.288581 -0.208743 -0.218482 -0.047321 0.630464 -0.212851 0.294042 0.252162 -0.282311 -0.041047 -0.041203 -0.165750 -0.156691 0.258990 0.479209 0.452229 -0.241956 -0.029422 -0.175854 -0.126973 -0.129911
polarizability: 3.50226927e+02 -8.38225927e+00 2.35245345e+02 2.78099464e-02 5.69475848e-02 1.13244962e+02
1716.lowfreq: -7.0466 -2.4977 -0.0012 -0.0009 -0.0007 6.5533 14.9937 27.1693 34.8351
frequency: 14.5588 27.0924 34.7227 37.5737 48.1164 68.2113 70.7076 94.8835 123.2964 151.9749 169.2985 180.4746 192.2381 219.8454 222.4902 255.5762 271.1176 284.7837 292.0061 323.3181 324.1932 374.4428 378.0388 408.0499 410.1206 428.1431 453.5909 474.8039 480.3282 520.5932 533.8036 607.5622 608.8828 633.8153 645.2752 679.6070 698.0549 715.2349 727.6824 736.4814 776.1315 795.3286 815.7929 825.3604 845.7188 853.8461 882.1642 918.3549 936.0053 937.3967 939.5188 947.1114 956.2824 982.8558 987.5818 988.3960 1003.0090 1012.1437 1041.5228 1047.2006 1068.7084 1112.8408 1127.8302 1133.4759 1137.9163 1177.4252 1190.2730 1193.2446 1218.2795 1223.6781 1259.5656 1276.9774 1281.1922 1307.5112 1311.6229 1333.5593 1364.1677 1377.1212 1380.6928 1393.6187 1396.0738 1397.2832 1410.4033 1433.2087 1456.3365 1466.9203 1469.1547 1470.4945 1471.9678 1478.5585 1481.0989 1484.9922 1489.9626 1506.1610 1511.4514 1530.7624 1589.5684 1596.6688 1626.7151 1629.6107 1650.4665 2945.9277 2974.2875 2974.4166 2975.5006 2978.4713 3012.3601 3051.7483 3068.6611 3074.4910 3077.1880 3080.8083 3082.4367 3084.6011 3101.2484 3114.9129 3122.8520 3135.4242 3140.0917 3182.9419 3196.1701 3520.9858 3540.6018
redmass: 3.7543 2.8203 1.5092 2.0006 4.2812 5.7562 3.9090 3.0033 4.1765 3.1892 2.8661 4.3096 1.0747 1.0533 2.4944 1.2644 2.8886 3.0582 3.5163 3.0703 5.0562 3.4458 3.7090 2.9535 3.2048 1.7521 3.3765 2.6008 5.4920 2.4068 2.9789 1.2207 5.7751 6.9013 4.1224 3.8353 11.5114 2.9768 5.5005 2.8154 5.3903 5.4771 1.4779 1.3769 4.9761 1.2971 2.9410 1.1806 1.4130 1.3544 2.6729 1.3890 1.4170 1.6591 1.3182 1.5278 3.8169 3.0075 1.5135 1.5345 1.6428 2.5492 1.3679 1.8391 1.9492 1.9997 2.0237 1.1103 1.8290 2.5060 2.3881 1.4131 2.2978 1.3261 1.4381 2.1568 4.3576 1.1953 3.7011 1.2859 1.2313 1.2339 3.8038 3.1635 1.7639 1.0444 1.0509 1.0456 1.1590 1.0517 1.0450 1.2751 1.1379 1.8364 2.6926 2.2680 5.6109 5.1992 6.3825 6.0915 3.6788 1.0401 1.0370 1.0348 1.0616 1.0566 1.0979 1.0977 1.1001 1.0995 1.1006 1.0987 1.0996 1.0939 1.0879 1.0870 1.0908 1.0956 1.0965 1.0915 1.0940 1.0762 1.0750
irintensity: 0.8739 1.0354 0.3891 0.3427 0.0552 7.9215 0.3886 1.3741 2.9648 2.6445 0.1546 1.7305 0.5062 0.0194 1.7277 0.6445 2.3816 0.6534 0.2601 0.1716 10.1789 1.0342 0.3051 0.0001 2.8038 0.0130 0.6008 16.9106 10.0788 30.2207 0.6033 104.2109 1.8154 1.3498 26.3071 1.0926 27.4033 0.6444 0.6921 1.6970 2.7012 0.0293 57.2028 31.9386 3.2043 23.6244 0.4730 4.2702 12.3274 7.5834 10.0542 2.9461 0.8263 5.1296 4.3189 11.2052 10.1337 4.9025 5.7080 11.1942 14.7761 1.0917 10.8164 11.0247 10.9268 154.7109 170.4492 2.6237 31.2517 0.9370 177.8417 10.3283 10.6629 0.6885 54.8694 20.8958 133.5665 15.5757 138.3297 22.9225 12.2534 1.1023 17.5283 253.1172 207.3551 3.3078 2.4006 12.4188 146.0745 2.5645 14.0339 42.0330 10.9874 140.2121 740.5768 115.7492 127.9546 27.9757 36.4027 19.3106 81.0328 46.1960 54.4768 33.9223 28.0856 31.1516 26.3117 23.0365 2.5742 103.1505 23.7316 20.8760 44.3874 21.5137 24.5867 15.4301 23.2468 22.3629 31.9419 9.1026 6.6376 10.4234 26.7322
temp: 298.150 k
press: 1.00000 atm
elementType: 8 7 7 6 6 6 6 6 6 6 6 6 6 6 6 6 6 6 6 6 6 1 1 1 1 1 1 1 1 1 1 1 1 1 1 1 1 1 1 1 1 1 1
symmnumber: 1
zpe: 940662.0 jmol-1
zpe.correction: 0.358279 hartree
zpe.thermalcorrener: 0.379833 hartree
zpe.thermalcorrenthalpy: 0.380777 hartree
zpe.thermalcorrgfe: 0.305104 hartree
zpe.sumelectzpe: -882.347944 hartree
zpe.sumelectthermal: -882.326390 hartree
zpe.sumelectthermalent: -882.325446 hartree
zpe.sumelectthermalfe: -882.401119 hartree
dipole: 0.7901 3.8426 0.0032
dipole: 3.9230
quadrupole: -110.9488 -108.3600 -133.2481
quadrupole: 1.0890 0.0062 0.0106
quadrupole: 6.5702 9.1590 -15.7291 1.0890 0.0062 0.0106
hfenergy: -882.706223 hartree
pointgroup: C01 [X(C18H22N2O1)]
dipole: 0.2962746 1.5147083 -0.0017073 debye
polarizability: 350.3597405|-7.2730419|235.0946057|-2.062999|0.0926567|113.2628877 unknown
InChI: InChI=1S/C18H22N2O/c1-12(2)15-8-7-14(4)17(11-15)20-18(21)19-16-9-5-13(3)6-10-16/h5-12,19-20H,1-4H3
charge 0 multiplicity 1
43 atoms
O  0.350347 -0.936675 -0.027282
N  -0.605454 1.226051 -0.018443
N  1.713184 0.987513 -0.038319
C  -4.432211 -2.071456 0.017256
C  -3.898885 -0.635712 0.011716
C  -2.504511 -0.390015 -0.000907
C  -2.001384 0.933926 -0.005684
C  -2.89689 2.052361 0.002408
C  -4.786434 0.465876 0.019508
C  -3.992097 -2.839807 1.292311
C  -4.009398 -2.844003 -1.261061
C  -4.282788 1.785981 0.014893
C  -2.383585 3.483697 -0.002119
C  0.472788 0.323351 -0.028406
C  3.014401 0.407709 -0.049309
C  5.700072 -0.596315 -0.071765
C  4.122307 1.295927 -0.056943
C  3.254185 -0.992851 -0.052975
C  5.44087 0.797021 -0.067972
C  4.58085 -1.468441 -0.064069
C  7.118963 -1.138813 -0.083582
H  -5.53989 -2.014061 0.024699
H  -1.789444 -1.214673 -0.007295
H  -5.869193 0.294174 0.029187
H  -2.891912 -2.939641 1.332969
H  -4.425893 -3.85729 1.301128
H  -4.31808 -2.314571 2.208194
H  -4.346955 -2.321333 -2.174209
H  -4.444123 -3.86114 -1.26106
H  -2.909937 -2.945071 -1.315929
H  -4.980773 2.632125 0.021108
H  -0.382871 2.22256 -0.020512
H  -3.226285 4.194339 0.006067
H  -1.763775 3.713462 0.889369
H  -1.780721 3.713981 -0.905025
H  1.707661 2.009794 -0.037419
H  3.955091 2.381694 -0.054216
H  2.406365 -1.679339 -0.047068
H  6.279483 1.503584 -0.073664
H  4.747872 -2.552981 -0.066737
H  7.303717 -1.767038 -0.975442
H  7.863039 -0.323606 -0.08801
H  7.317393 -1.769894 0.803307
