program: Gaussian 09
title: 000240151
version: EM64L-G09RevD.01
frameworkgroup: C1[X(C12H24O2)]
method: RPBEPBE
basis: SDD
operation: Freq
keyword: #pfreq=noraman
keyword: PBEPBE/SDD
title: #p freq=noraman PBEPBE/SDD
converged: YES YES NO NO
title: Mulliken charges:
elementType: O O C C C C C C C C C C C C H H H H H H H H H H H H H H H H H H H H H H H H
charge: -0.267140 -0.267750 0.310067 -0.401998 -0.413293 0.370727 -0.348109 -0.767559 -0.411854 -0.402564 -0.725572 -0.355600 -0.696861 -0.705095 0.184856 0.224602 0.234305 0.181505 0.179171 0.238212 0.222164 0.218686 0.209207 0.196413 0.196018 0.218220 0.196439 0.212451 0.232933 0.233419 0.219592 0.218306 0.214856 0.207530 0.214711 0.206791 0.206811 0.215402
chargesum: 0.00000
title: Mulliken charges with hydrogens summed into heavy atoms:
elementType: O O C C C C C C C C C C C C
charge: -0.267140 -0.267750 0.310067 0.007460 0.002516 0.370727 0.069274 -0.117501 -0.019423 0.012095 -0.046769 0.082298 -0.059764 -0.076090
polarizability: 1.50007572e+02 -1.25752776e+00 1.39271362e+02 1.17903046e+00 1.70057486e-01 1.14189969e+02
1716.lowfreq: -15.5250 -10.6330 -7.4520 -0.0009 -0.0008 -0.0007 36.2550 58.6227 66.2724
frequency: 35.7596 58.3386 66.2373 72.7351 93.3049 119.6796 160.8490 168.8863 183.5310 213.2963 224.5249 233.8544 242.5828 263.9357 282.6500 289.4028 319.9359 349.4484 377.2460 399.0855 412.5815 455.1998 482.2615 507.2522 552.0223 654.1188 698.9013 718.9308 735.6068 772.5195 777.9749 858.8478 876.3234 879.2355 889.6759 894.1577 938.2241 941.9379 952.6956 978.6967 990.1179 1008.2535 1035.0386 1036.7847 1047.6006 1056.5861 1081.0452 1102.4948 1140.3674 1153.6696 1172.8085 1179.7346 1199.3059 1229.2883 1242.6261 1244.0935 1261.2799 1291.4587 1296.2072 1300.2311 1301.6530 1311.0586 1332.8970 1352.9234 1358.0513 1364.0590 1377.5264 1387.6953 1388.0229 1391.1145 1442.8231 1453.5756 1459.1574 1460.8869 1470.7167 1475.1059 1475.7430 1477.7644 1478.4713 1479.0111 1479.9181 1485.5707 1487.7420 1489.3097 2940.8805 2948.0780 2958.5594 2967.3541 2969.3993 2971.2699 2975.4035 2988.9240 2998.7176 3004.2143 3018.9356 3036.7418 3045.5907 3050.8375 3055.2065 3060.1170 3068.6533 3069.4572 3070.4178 3071.7575 3074.5871 3078.9699 3093.9965 3101.5118
redmass: 3.1401 1.7261 2.7161 1.6278 3.1212 2.6421 2.2493 1.3073 1.1051 2.4154 1.4346 1.1477 1.8039 2.4522 2.8014 2.6752 2.8420 3.1426 2.3133 2.4775 2.2394 2.6139 4.0211 4.4277 4.0165 4.2140 4.0662 1.7583 1.1952 1.5891 2.2948 1.3318 1.7518 1.3377 1.9373 1.8284 2.0121 1.8660 3.3055 1.8023 2.3191 1.8181 1.3593 2.3664 2.7925 2.2130 3.2191 2.2061 2.8530 1.9045 2.0592 2.0503 1.7176 1.3786 2.4446 1.2979 1.3526 1.4407 1.1231 1.3557 1.4493 1.3768 1.2430 1.4939 1.5615 1.4552 1.2284 1.2155 1.2099 1.2041 1.0836 1.0726 1.0707 1.0705 1.0625 1.0500 1.0498 1.0456 1.0480 1.0474 1.0546 1.0753 1.0779 1.0860 1.0668 1.0672 1.0643 1.0356 1.0386 1.0363 1.0584 1.0581 1.0371 1.0594 1.0960 1.0990 1.0979 1.1011 1.0971 1.0975 1.0985 1.0995 1.0994 1.0997 1.0943 1.1036 1.0986 1.1002
irintensity: 0.0731 0.0452 0.2107 0.0208 0.7228 1.5822 1.1917 0.2226 0.0978 1.5841 0.0479 0.2224 0.9906 2.8369 0.1890 3.6481 0.4347 10.8064 1.2768 0.1331 1.2653 0.3997 4.2579 5.6741 5.3923 2.8304 7.8822 6.2784 10.1284 31.3541 14.2405 0.3311 0.8841 5.0152 0.7633 11.5814 8.3625 14.1719 18.7393 0.5574 44.5582 11.3832 14.7984 13.1908 62.1471 7.3753 63.4877 7.3569 44.7797 20.1138 13.8253 15.2890 2.0671 1.8400 45.0030 5.2686 3.6333 5.1163 1.4711 9.9869 3.3607 5.2819 0.3402 1.6683 3.4139 11.1639 30.7021 13.1439 6.2971 25.6485 4.7022 8.7495 5.1243 1.7506 1.5014 8.1400 14.7206 5.5862 3.7334 8.4119 3.9418 12.3014 21.9300 15.1049 34.1568 95.8774 13.6619 52.5571 35.4543 51.3962 37.9129 13.8190 23.8420 41.8206 6.0388 8.9153 11.2397 1.3702 8.7366 46.9764 57.1085 69.0059 9.8267 58.8048 60.0035 74.7794 34.5442 22.8434
temp: 298.150 k
press: 1.00000 atm
elementType: 8 8 6 6 6 6 6 6 6 6 6 6 6 6 1 1 1 1 1 1 1 1 1 1 1 1 1 1 1 1 1 1 1 1 1 1 1 1
symmnumber: 1
zpe: 891228.8 jmol-1
zpe.correction: 0.339451 hartree
zpe.thermalcorrener: 0.356531 hartree
zpe.thermalcorrenthalpy: 0.357475 hartree
zpe.thermalcorrgfe: 0.295307 hartree
zpe.sumelectzpe: -620.942004 hartree
zpe.sumelectthermal: -620.924924 hartree
zpe.sumelectthermalent: -620.923980 hartree
zpe.sumelectthermalfe: -620.986148 hartree
dipole: 1.3776 -1.5967 -0.1335
dipole: 2.1131
quadrupole: -85.7745 -86.1962 -91.5243
quadrupole: -0.1304 1.0364 0.5420
quadrupole: 2.0572 1.6355 -3.6927 -0.1304 1.0364 0.5420
hfenergy: -621.281455 hartree
pointgroup: C01 [X(C12H24O2)]
dipole: 0.5274889 0.6400428 0.0570683 debye
polarizability: 149.9263406|1.5253594|139.3288831|-1.3921889|0.443899|114.2136787 unknown
InChI: InChI=1S/C12H24O2/c1-5-7-11(3)9-13-12(4,8-6-2)14-10-11/h5-10H2,1-4H3
charge 0 multiplicity 1
38 atoms
O  -0.807661 0.780655 -1.156719
O  -0.516227 0.359223 1.220251
C  1.504542 0.853915 -0.178257
C  0.514384 1.430279 -1.229118
C  0.805735 1.012176 1.197602
C  -1.441249 0.851702 0.177579
C  1.795979 -0.63798 -0.521122
C  2.796756 1.704491 -0.191284
C  -2.612865 -0.144962 0.141932
C  2.635441 -1.432295 0.505281
C  -1.912953 2.288089 0.489074
C  -2.204772 -1.602542 -0.160138
C  2.945878 -2.861059 0.006164
C  -3.424631 -2.547877 -0.187347
H  0.416463 2.530219 -1.095557
H  0.862673 1.231043 -2.25768
H  1.371982 0.522786 2.006577
H  0.711752 2.092315 1.445663
H  2.317769 -0.662845 -1.50214
H  0.828783 -1.155211 -0.665563
H  3.506692 1.372868 0.588129
H  3.30962 1.622371 -1.168146
H  2.579415 2.775138 -0.010827
H  -3.328592 0.209886 -0.62498
H  -3.125537 -0.093941 1.122287
H  2.086966 -1.499892 1.464843
H  3.588204 -0.906847 0.7171
H  -1.086599 3.01907 0.491371
H  -2.647428 2.60663 -0.270383
H  -2.392759 2.311081 1.4826
H  -1.48074 -1.93587 0.606027
H  -1.681396 -1.630532 -1.133741
H  2.012001 -3.420378 -0.191205
H  3.526031 -2.835895 -0.935873
H  3.531933 -3.431903 0.749831
H  -3.953095 -2.548244 0.785329
H  -4.151581 -2.240527 -0.963588
H  -3.120317 -3.58834 -0.40507
