program: Gaussian 09
title: 000240145
version: EM64L-G09RevD.01
frameworkgroup: C1[X(C11H22O2)]
method: RPBEPBE
basis: SDD
operation: Freq
keyword: #pfreq=noraman
keyword: PBEPBE/SDD
title: #p freq=noraman PBEPBE/SDD
converged: YES YES NO NO
title: Mulliken charges:
elementType: O O C C C C C C C C C C C H H H H H H H H H H H H H H H H H H H H H H
charge: -0.267054 -0.266431 0.312706 -0.411009 -0.401402 -0.349247 0.383038 -0.770375 -0.401972 -0.403958 -0.716465 -0.695800 -0.706866 0.182012 0.232191 0.224699 0.184659 0.238460 0.179761 0.219262 0.223463 0.208782 0.199128 0.214091 0.201321 0.201973 0.212823 0.232235 0.232145 0.207575 0.215354 0.214494 0.232804 0.231979 0.205623
chargesum: 0.00000
title: Mulliken charges with hydrogens summed into heavy atoms:
elementType: O O C C C C C C C C C C C
charge: -0.267054 -0.266431 0.312706 0.003195 0.007955 0.068973 0.383038 -0.118867 0.011248 -0.000664 -0.039262 -0.058377 -0.036460
polarizability: 1.38009677e+02 1.63998624e+00 1.25648574e+02 -8.78079002e-01 8.33339635e-02 1.05898942e+02
1716.lowfreq: -18.8574 -5.2479 -3.4562 -0.0004 -0.0001 0.0002 45.0801 57.3525 74.8995
frequency: 44.8885 57.3349 74.8473 102.6625 117.6670 158.3064 190.8208 197.2889 214.5767 222.2551 240.5983 246.5437 271.1041 294.1739 314.5871 365.1643 371.4028 399.0678 415.3710 445.4473 476.6407 507.1800 539.8992 642.5877 677.8475 722.6361 732.9990 773.6015 822.3186 858.3321 873.0116 889.9835 893.5440 937.3066 953.1876 978.6189 981.2797 1003.0457 1013.4496 1025.6775 1042.0350 1055.4528 1060.3852 1103.2474 1135.6858 1146.6637 1170.7778 1179.2832 1199.2436 1229.2030 1243.8094 1260.8955 1279.6234 1296.1445 1302.0081 1309.8972 1332.8785 1349.3707 1354.9256 1361.9229 1373.6861 1383.4333 1387.9428 1394.0589 1445.6331 1454.4767 1457.8994 1458.8985 1468.5583 1472.4738 1475.8796 1477.3483 1480.0798 1481.0785 1484.7997 1488.8123 1492.9625 2940.6213 2947.0547 2959.6454 2970.3639 2971.2173 2975.4319 2992.1063 2997.2895 3002.7810 3018.2629 3046.0381 3055.3261 3055.3847 3060.5921 3069.5143 3070.9268 3072.5893 3074.6814 3085.2625 3094.6141 3100.0094 3105.7293
redmass: 2.5324 1.9161 2.1395 2.5454 2.4089 1.2040 2.2616 1.4318 1.2414 2.2468 1.6484 1.4250 2.0820 2.5546 2.5995 2.6761 2.6652 2.4582 2.1895 2.6080 3.7966 4.2535 3.7991 3.7445 4.6485 2.0183 1.2084 2.7767 1.4484 1.3603 1.8143 1.9534 1.8939 2.0325 3.4347 1.7732 1.9047 1.4453 2.1900 1.3587 2.5336 3.3938 2.4797 2.2154 2.9834 1.9039 2.2402 1.9304 1.6947 1.3329 2.5952 1.4046 1.1580 1.3513 1.4749 1.3208 1.2427 1.6648 1.5197 1.3862 1.2270 1.2162 1.2095 1.2009 1.0806 1.0724 1.0702 1.0730 1.0432 1.0648 1.0597 1.0473 1.0569 1.0611 1.0642 1.0695 1.0545 1.0679 1.0669 1.0644 1.0387 1.0362 1.0579 1.0370 1.0393 1.0546 1.0961 1.0978 1.1011 1.0972 1.0976 1.0998 1.0991 1.0988 1.0945 1.0987 1.0985 1.1003 1.1010
irintensity: 0.1731 0.0280 0.0777 0.8051 1.1309 0.0455 2.3856 0.7774 0.4410 0.7946 0.4695 0.5596 2.1117 3.7630 0.3819 12.0860 2.0652 0.1808 1.3237 0.2229 2.4802 4.2490 7.1480 1.5060 6.0811 11.0532 11.7910 3.4882 38.2999 0.7640 5.8061 2.8709 12.3568 7.5639 19.3266 2.2531 6.4326 28.8917 65.0224 21.3960 5.9409 70.4511 51.6657 6.1769 43.5454 15.5417 8.5121 14.9883 2.5388 1.3656 40.8909 4.7048 5.1084 0.5992 2.4522 3.3315 0.2762 4.9008 2.6055 8.7140 24.1257 27.2517 5.8307 25.3823 4.1853 9.0810 2.5287 4.0157 12.5254 2.1208 9.6302 13.7485 0.6019 3.4954 13.2818 22.0830 23.4771 31.1522 96.7923 13.1523 36.6981 52.6302 38.6806 34.6818 17.1206 35.9480 7.1374 11.9990 7.2963 9.7689 50.6816 69.6396 35.7422 34.4542 70.4690 41.8598 37.9041 5.9321 44.6761
temp: 298.150 k
press: 1.00000 atm
elementType: 8 8 6 6 6 6 6 6 6 6 6 6 6 1 1 1 1 1 1 1 1 1 1 1 1 1 1 1 1 1 1 1 1 1 1
symmnumber: 1
zpe: 818270.7 jmol-1
zpe.correction: 0.311663 hartree
zpe.thermalcorrener: 0.327271 hartree
zpe.thermalcorrenthalpy: 0.328216 hartree
zpe.thermalcorrgfe: 0.269856 hartree
zpe.sumelectzpe: -581.718935 hartree
zpe.sumelectthermal: -581.703327 hartree
zpe.sumelectthermalent: -581.702382 hartree
zpe.sumelectthermalfe: -581.760742 hartree
dipole: -0.5926 -1.9908 -0.2321
dipole: 2.0900
quadrupole: -79.0755 -80.3333 -85.1455
quadrupole: 0.2176 -1.1562 0.1920
quadrupole: 2.4426 1.1848 -3.6274 0.2176 -1.1562 0.1920
hfenergy: -582.030598 hartree
pointgroup: C01 [X(C11H22O2)]
dipole: -0.2581475 -0.7734456 -0.1062894 debye
polarizability: 138.0747694|1.2866261|125.5445478|-1.2107306|0.5497841|105.937875 unknown
InChI: InChI=1S/C11H22O2/c1-5-7-10(3)8-12-11(4,6-2)13-9-10/h5-9H2,1-4H3
charge 0 multiplicity 1
35 atoms
O  0.817308 0.176687 -1.188347
O  1.199112 -0.245441 1.174038
C  -0.94762 -1.027642 0.126166
C  -0.2193 -0.871063 -1.235076
C  0.163458 -1.295896 1.179578
C  -1.726547 0.261296 0.524974
C  1.838024 -0.040579 -0.142867
C  -1.878746 -2.261982 0.062068
C  -2.818743 0.739922 -0.458148
C  2.620861 1.280493 -0.035387
C  2.756979 -1.227799 -0.502685
C  -3.563268 1.984337 0.075419
C  1.748025 2.499622 0.319846
H  0.224568 -1.845584 -1.535507
H  -0.9059 -0.547207 -2.034029
H  -0.245059 -1.273389 2.205014
H  0.62103 -2.294345 1.003787
H  -0.993438 1.077077 0.669805
H  -2.196452 0.079963 1.515611
H  -2.426516 -2.389786 1.014802
H  -2.628335 -2.163314 -0.743977
H  -1.305976 -3.190475 -0.127328
H  -3.553509 -0.068669 -0.644317
H  -2.363519 0.989051 -1.436486
H  3.126984 1.443391 -1.00572
H  3.40767 1.138234 0.729351
H  2.210893 -2.183424 -0.578152
H  3.244605 -1.035462 -1.473857
H  3.534824 -1.340056 0.272083
H  -4.057256 1.7672 1.041562
H  -2.861218 2.823304 0.23988
H  -4.340291 2.326492 -0.632831
H  0.962483 2.646444 -0.440792
H  1.261666 2.354458 1.299366
H  2.365202 3.41544 0.367855
