program: Gaussian 09
title: 000240140
version: EM64L-G09RevD.01
frameworkgroup: C1[X(C7H10O4)]
method: RPBEPBE
basis: SDD
operation: Freq
keyword: #pfreq=noraman
keyword: PBEPBE/SDD
title: #p freq=noraman PBEPBE/SDD
converged: YES YES NO NO
title: Mulliken charges:
elementType: O O O O C C C C C C C H H H H H H H H H H
charge: -0.244370 -0.244376 -0.225550 -0.225550 -0.101753 -0.101793 -0.454437 -0.454485 -0.415843 0.015951 0.015967 0.292589 0.292596 0.244265 0.243179 0.244277 0.243155 0.228676 0.228636 0.209434 0.209433
chargesum: 0.00000
title: Mulliken charges with hydrogens summed into heavy atoms:
elementType: O O O O C C C C C C C
charge: -0.244370 -0.244376 -0.225550 -0.225550 0.190836 0.190804 0.033007 0.032947 0.041468 0.225385 0.225400
polarizability: 1.04378859e+02 -3.96422809e-03 7.16153242e+01 1.06968017e+00 -7.23280139e-03 7.75267801e+01
1716.lowfreq: -43.1448 -9.8758 -7.1627 -0.0010 -0.0006 0.0008 10.5486 36.1217 54.3693
frequency: -42.8866 36.1148 54.0923 92.4017 115.6365 192.8260 228.2406 230.8199 277.0485 369.8084 420.4571 436.0269 681.8632 696.0221 704.4639 715.3503 779.7927 808.3475 832.1092 886.1533 914.6511 929.5933 956.0735 957.3684 957.8725 1060.0084 1074.0500 1082.0673 1083.1423 1091.6667 1146.9617 1194.1240 1205.3835 1253.6173 1263.8313 1265.0031 1300.8074 1317.4964 1323.6467 1333.1752 1339.9380 1347.8808 1453.3466 1453.6946 1482.5859 1619.0837 1628.0540 3017.0956 3023.1766 3032.3290 3039.5315 3039.7959 3069.9494 3074.9412 3085.1623 3090.0443 3101.8411
redmass: 1.8186 11.3394 6.6084 3.3871 5.5916 9.4089 3.1971 2.4987 3.2972 4.8120 2.9862 3.5465 4.8002 2.7158 5.6756 2.4031 2.6465 3.7846 2.7348 2.8276 2.3704 2.3464 2.3524 1.5918 1.6098 1.9971 2.4038 1.3932 9.9781 6.3859 1.3722 1.3503 1.5148 1.3054 1.4036 1.2035 1.3105 1.2729 1.5133 1.3569 1.1209 1.3708 1.0801 1.0806 1.0892 9.0511 8.8849 1.0592 1.0624 1.0645 1.0920 1.0918 1.1018 1.0869 1.0906 1.1024 1.1039
irintensity: 0.0432 3.1935 0.0959 0.9949 4.6402 0.5394 8.4188 15.5450 3.0522 26.9216 9.3790 18.1862 1.7413 6.6768 2.3788 10.7683 0.0269 26.3154 9.0537 4.3140 10.9268 3.7080 0.5159 1.1580 6.6306 26.4102 6.6645 26.3355 630.4558 68.0600 0.0553 9.3844 7.8846 8.9055 3.9592 1.5343 5.7924 0.9958 6.8226 9.6774 7.0850 1.7053 1.7339 25.7257 11.0303 493.3733 72.1281 18.4960 26.1791 22.6155 105.3387 2.1243 6.6791 3.3418 9.4319 1.8321 55.5682
temp: 298.150 k
press: 1.00000 atm
elementType: 8 8 8 8 6 6 6 6 6 6 6 1 1 1 1 1 1 1 1 1 1
symmnumber: 1
zpe: 431651.9 jmol-1
zpe.correction: 0.164408 hartree
zpe.thermalcorrener: 0.174626 hartree
zpe.thermalcorrenthalpy: 0.175570 hartree
zpe.thermalcorrgfe: 0.127023 hartree
zpe.sumelectzpe: -572.771728 hartree
zpe.sumelectthermal: -572.761510 hartree
zpe.sumelectthermalent: -572.760566 hartree
zpe.sumelectthermalfe: -572.809113 hartree
dipole: 0.0000 1.9470 0.0004
dipole: 1.9470
quadrupole: -74.5107 -63.5130 -64.2496
quadrupole: 0.0064 -12.7066 0.0020
quadrupole: -7.0862 3.9114 3.1748 0.0064 -12.7066 0.0020
hfenergy: -572.9361357 hartree
pointgroup: C01 [X(C7H10O4)]
dipole: 0.7660062 -0.0003041 -0.0000228 debye
dipolederiv: -0.4853048 -0.3850327 0.1084641 -0.4472041 -1.4388193 0.3129037 0.0910663 0.256628 -0.5679417 -0.4848611 0.3844785 -0.1084097 0.446702 -1.4395095 0.3128538 -0.0910116 0.2564843 -0.5678015 -0.4110792 -0.2066968 0.1249727 -0.0942803 -0.5767789 0.0098077 0.2912634 0.5119208 -0.8415144 -0.4111399 0.2069546 -0.1253447 0.0940928 -0.5769588 0.009829 -0.2912527 0.5120675 -0.8413427 0.3509249 0.0378232 0.1087236 0.1737986 0.7356023 -0.0322854 0.1828797 0.2206011 0.1890161 0.3505507 -0.0373023 -0.1088589 -0.1735199 0.7358098 -0.0321934 -0.1827782 0.2209111 0.1889319 -0.0551417 -0.0009312 -0.0887639 0.0059538 0.0099192 0.0779419 -0.080302 -0.0442107 0.0213825 -0.055102 0.001018 0.0888064 -0.005845 0.0099575 0.077857 0.080225 -0.0443327 0.0214082 0.0611988 -0.000027 0.0000096 0.0000493 0.1372006 0.0399354 0.0000034 0.0290948 0.00779 0.4208634 0.5630831 -0.3037426 0.4779219 1.3957791 -0.2572613 -0.4616991 -0.7093195 1.158209 0.4206633 -0.5629732 0.3042969 -0.4773111 1.3965791 -0.257289 0.4618618 -0.7094659 1.1578555 -0.0452926 0.0032212 0.0554509 -0.0533238 0.0120117 0.0034607 0.0585966 -0.0668916 0.0274846 -0.0451365 -0.0032054 -0.0554322 0.0533892 0.0120479 0.0035149 -0.0586132 -0.0668329 0.0275255 0.0555658 0.0442267 -0.0190603 0.0475105 -0.083293 0.100438 0.004547 0.0793465 0.0433898 0.0489828 -0.0540809 0.0423252 -0.0202968 0.0054206 -0.112569 0.0221159 -0.094909 -0.0311977 0.0554544 -0.0443818 0.0192125 -0.0476942 -0.0831197 0.1005252 -0.0044019 0.0794453 0.0432825 0.0490437 0.0540541 -0.0424459 0.0202622 0.0052071 -0.1125774 -0.0222204 -0.0949389 -0.0310457 -0.0375159 -0.0875874 -0.0408263 -0.1347551 -0.0399599 -0.0427478 -0.0574346 -0.0359529 0.0338427 -0.0375811 0.0876227 0.0408182 0.1347837 -0.040029 -0.0426853 0.0573952 -0.0359141 0.0339314 0.1274144 -0.0453852 0.0201459 -0.0570928 -0.088487 -0.0797249 -0.0036811 -0.1318509 -0.0366274 0.1274927 0.0451217 -0.0203417 0.0568591 -0.0885798 -0.0797338 0.0034407 -0.1318806 -0.036579 unknown
polarizability: 71.615325|0.0099558|101.2044376|0.0035889|-8.7353908|80.7012011 unknown
InChI: InChI=1S/C7H10O4/c8-4-10-6-2-1-3-7(6)11-5-9/h4-7H,1-3H2
charge 0 multiplicity 1
21 atoms
O  -0.211573 -1.814464 -0.291434
O  -0.209167 1.814937 0.291152
O  -0.97591 -2.976185 1.599348
O  -0.97415 2.976978 -1.59919
C  -0.012043 -0.563797 0.522195
C  -0.011274 0.563964 -0.522372
C  1.403317 -0.530199 1.132269
C  1.404127 0.528536 -1.132213
C  2.343156 -0.000972 0.000286
C  -0.694427 -2.925657 0.386805
C  -0.691763 2.926391 -0.386865
H  -0.823958 -0.492745 1.264032
H  -0.823178 0.493935 -1.264314
H  1.698176 -1.517217 1.524943
H  1.386093 0.172666 1.984255
H  1.700102 1.515002 -1.525444
H  1.386291 -0.174887 -1.983729
H  2.997095 0.799913 0.385182
H  2.99716 -0.801992 -0.38422
H  -0.790512 -3.757122 -0.336797
H  -0.78666 3.758014 0.336709
