program: Gaussian 09
title: 000240149
version: EM64L-G09RevD.01
frameworkgroup: C1[X(C14H19ClO3)]
method: RPBEPBE
basis: SDD
operation: Freq
keyword: #p
keyword: freq=noraman
keyword: PBEPBE/SDD
title: #p freq=noraman PBEPBE/SDD
converged: YES YES NO NO
title: Mulliken charges:
elementType: Cl O O O C C C C C C C C C C C C C C H H H H H H H H H H H H H H H H H H H
charge: -0.046216 -0.278643 -0.258312 -0.268305 0.350584 -0.423326 0.001455 -0.366974 -0.580981 -0.742870 -0.623418 0.508501 -0.401374 -0.408256 -0.355369 -0.358932 0.315742 -0.538121 0.235357 0.213225 0.254372 0.200823 0.236329 0.243223 0.216737 0.244960 0.238795 0.218127 0.271610 0.263904 0.239341 0.228694 0.248575 0.237183 0.218983 0.244562 0.220014
chargesum: 0.00000
title: Mulliken charges with hydrogens summed into heavy atoms:
elementType: Cl O O O C C C C C C C C C C C C C C
charge: -0.046216 -0.278643 -0.258312 -0.268305 0.350584 0.025256 0.255827 0.070178 -0.121021 -0.040988 -0.087903 0.508501 -0.162032 -0.179563 -0.106794 -0.121749 0.315742 0.145438
polarizability: 2.11699932e+02 2.69368347e+00 1.70648729e+02 1.14888832e+01 7.29855270e-01 1.22348914e+02
1716.lowfreq: -8.4385 -5.2692 -0.0017 0.0008 0.0010 3.5435 7.0746 18.7706 34.2210
frequency: -4.8677 18.6947 34.1924 43.0376 78.8991 84.6636 106.2389 129.2975 162.3551 172.2672 199.0449 211.4901 223.7511 243.6453 275.6107 316.9606 321.4452 343.2342 358.5693 409.3166 413.7658 427.9600 440.7903 490.0042 516.9819 547.0023 622.9191 633.2571 651.2141 688.2690 710.3843 726.4402 742.0520 772.0709 788.8671 810.2735 823.0767 830.9390 845.2535 888.4772 927.7190 940.5045 964.1559 970.8380 984.9504 989.3872 1000.7228 1002.9998 1027.2312 1042.5511 1075.9646 1091.5619 1107.1733 1111.6072 1128.4472 1155.7239 1165.4387 1177.4176 1192.5879 1201.8578 1216.7879 1229.5174 1241.5418 1247.4421 1275.8310 1297.3924 1300.9580 1310.2898 1324.1973 1341.7649 1353.8748 1381.5246 1390.9390 1416.0417 1428.6840 1435.9528 1452.6323 1464.0590 1466.5222 1469.9473 1473.7667 1484.8223 1487.0361 1501.8611 1584.3188 1623.4691 2956.2612 2963.2192 2989.0459 2996.4369 3008.9574 3035.0613 3039.4755 3042.3458 3042.4571 3064.5318 3093.5192 3109.8112 3115.2629 3118.2508 3121.3464 3123.1251 3128.5414 3158.8990 3164.3279
redmass: 10.3167 3.7041 4.9029 4.5437 3.3288 4.1866 3.4031 3.3281 3.2933 3.5260 1.3155 2.0644 2.6125 1.3545 3.6535 4.7613 2.3810 3.1855 3.2398 2.8241 2.9301 4.2653 3.8945 3.5632 3.5255 2.8804 3.5269 6.6993 4.4127 6.4975 3.8501 5.6000 3.6462 2.4942 1.5170 1.6112 2.2278 2.4674 2.0982 1.6527 1.7468 1.6347 1.3974 1.7871 4.9418 8.2087 3.0102 2.7093 3.2637 2.2956 1.6634 2.1965 1.8208 1.2607 1.3691 1.3365 1.1727 1.2202 1.7868 1.3421 2.0812 4.4376 1.9696 1.1728 1.3548 1.3211 1.5120 1.3476 1.1866 1.4252 1.3118 4.7652 1.3020 3.2327 1.1071 1.1717 1.0721 1.0602 1.0506 1.0609 1.0747 1.0851 1.1031 2.4572 6.9524 6.4718 1.0331 1.0688 1.0601 1.0596 1.0361 1.0848 1.0951 1.0656 1.1010 1.1035 1.0968 1.0993 1.0896 1.0896 1.1004 1.0990 1.1095 1.0935 1.0950
irintensity: 0.0231 0.8895 0.5727 0.4408 6.0364 1.1774 3.8637 8.1863 0.2772 2.5843 0.1922 3.7823 3.7273 0.5309 1.1312 3.5054 0.4671 1.8803 0.8863 5.0130 0.5421 1.9511 10.1567 22.1839 21.9201 12.6179 0.8423 0.3659 5.0269 47.8746 5.1276 1.0686 7.8740 22.9176 18.7621 33.3777 6.6995 35.5441 27.4274 8.3732 5.9030 2.8404 0.0780 6.0088 39.2087 42.6779 85.0717 4.8686 12.2961 0.8245 41.4888 3.3942 28.3869 0.1481 14.2046 0.6988 0.5135 53.9807 91.8613 11.2874 36.8530 156.0332 26.9729 7.4274 18.0989 6.2935 17.2347 11.0573 2.8834 8.5553 1.0752 12.7120 46.2371 0.9258 6.0094 9.8563 5.7421 2.9307 13.4841 15.6402 57.2810 5.7677 13.4014 124.3971 6.1146 35.8039 70.8030 45.8489 2.3020 43.2092 9.2026 20.4812 3.4313 10.1325 61.6958 36.3504 29.0788 15.4764 17.5700 25.6017 21.8235 19.7068 20.0652 16.8378 4.3330
temp: 298.150 k
press: 1.00000 atm
elementType: 17 8 8 8 6 6 6 6 6 6 6 6 6 6 6 6 6 6 1 1 1 1 1 1 1 1 1 1 1 1 1 1 1 1 1 1 1
symmnumber: 1
zpe: 794521.4 jmol-1
zpe.correction: 0.302617 hartree
zpe.thermalcorrener: 0.320303 hartree
zpe.thermalcorrenthalpy: 0.321247 hartree
zpe.thermalcorrgfe: 0.255192 hartree
zpe.sumelectzpe: -1229.210264 hartree
zpe.sumelectthermal: -1229.192578 hartree
zpe.sumelectthermalent: -1229.191634 hartree
zpe.sumelectthermalfe: -1229.257689 hartree
dipole: 1.5054 -2.0542 2.5371
dipole: 3.5948
quadrupole: -99.8265 -118.2063 -115.2630
quadrupole: -8.1257 -4.8150 7.3302
quadrupole: 11.2721 -7.1077 -4.1644 -8.1257 -4.8150 7.3302
hfenergy: -1229.5128812 hartree
pointgroup: C01 [X(C14H19Cl1O3)]
dipole: 0.577679 -0.9100746 0.9156028 debye
polarizability: 211.0576896|1.578769|169.9053666|13.7987637|6.2234569|123.7345185 unknown
InChI: InChI=1S/C14H19ClO3/c1-14(17-10-13(9-15)18-14)8-7-11-3-5-12(16-2)6-4-11/h3-6,13H,7-10H2,1-2H3
charge 0 multiplicity 1
37 atoms
Cl -3.345237 3.14748 -0.417659
O  -3.123363 -0.113162 -0.740687
O  -3.246742 -1.830832 0.857389
O  4.988884 1.1916 0.660964
C  -2.497432 -1.410034 -0.351847
C  -1.005371 -1.199551 -0.009082
C  -3.745531 0.488678 0.457357
C  -3.593084 -0.596848 1.575647
C  -0.167726 -0.636765 -1.191029
C  -2.771621 -2.425046 -1.454528
C  -3.069348 1.796455 0.865135
C  1.213917 -0.183721 -0.742013
C  1.461896 1.177739 -0.415537
C  2.27988 -1.102694 -0.593319
C  2.720677 1.603908 0.047266
C  3.553703 -0.696806 -0.131662
C  3.772133 0.664817 0.193393
C  6.108081 0.262462 0.823136
H  -0.586401 -2.165574 0.331389
H  -0.927184 -0.50155 0.846575
H  -4.80556 0.673865 0.20824
H  -2.797934 -0.322897 2.300258
H  -4.532245 -0.787315 2.117306
H  -0.722965 0.211166 -1.633371
H  -0.077428 -1.412756 -1.975038
H  -3.858662 -2.57109 -1.554687
H  -2.374079 -2.060964 -2.415822
H  -2.297704 -3.392119 -1.213694
H  -1.978333 1.684317 0.95565
H  -3.499982 2.193164 1.799235
H  0.658778 1.915497 -0.539547
H  2.119832 -2.158105 -0.848467
H  2.916311 2.652379 0.29267
H  4.354114 -1.436875 -0.036252
H  5.873201 -0.528805 1.562176
H  6.941601 0.877859 1.192594
H  6.389129 -0.204576 -0.141338
