program: Gaussian 09
title: 000240139
version: EM64L-G09RevD.01
frameworkgroup: C1[X(C14H18O4)]
method: RPBEPBE
basis: SDD
operation: Freq
keyword: #pfreq=noraman
keyword: PBEPBE/SDD
title: #p freq=noraman PBEPBE/SDD
converged: YES YES NO NO
title: Mulliken charges:
elementType: O O O O C C C C C C C C C C C C C C H H H H H H H H H H H H H H H H H H
charge: -0.250810 -0.249516 -0.268584 -0.264071 0.336519 -0.400425 -0.388386 -0.411861 -0.733745 -0.054281 -0.722158 0.394185 -0.509669 -0.388062 0.217087 0.164111 -0.326032 -0.205358 0.188676 0.238116 0.233795 0.188241 0.205480 0.197238 0.209819 0.202742 0.263819 0.190430 0.229521 0.222125 0.220459 0.286529 0.265762 0.249309 0.238977 0.230018
chargesum: 0.00000
title: Mulliken charges with hydrogens summed into heavy atoms:
elementType: O O O O C C C C C C C C C C C C C C
charge: -0.250810 -0.249516 -0.268584 -0.264071 0.336519 0.026367 0.033650 -0.009144 -0.057364 0.136150 -0.050053 0.394185 -0.223141 -0.122300 0.217087 0.164111 -0.076723 0.263637
polarizability: 2.34066811e+02 -6.47441906e+00 1.48750390e+02 1.02834196e+01 1.55939248e+00 1.06868098e+02
1716.lowfreq: -6.1152 -0.0006 0.0004 0.0006 5.4318 10.9668 26.2898 40.8408 69.6552
frequency: 25.1787 40.5711 69.6513 84.7161 92.2808 123.3063 173.1353 187.7957 203.4234 212.4003 221.3056 238.5195 263.4109 309.6082 330.4185 332.7621 358.6938 405.0222 412.2181 421.9027 453.8733 489.6198 514.8853 546.6429 578.8099 611.7329 650.8864 678.1525 715.6283 760.3682 771.8930 775.8058 794.7287 822.5053 841.7006 871.4973 885.3539 899.3407 918.5987 926.2798 933.1061 949.5115 950.6099 959.4365 968.4511 978.3086 1013.4514 1034.8317 1058.4982 1064.5524 1066.9880 1073.1007 1128.9568 1133.1082 1171.6034 1178.6240 1186.2403 1198.9989 1238.1206 1249.5454 1260.4609 1266.6149 1317.2645 1326.7619 1334.8568 1345.6765 1352.6737 1359.4840 1362.6539 1388.5476 1394.2094 1395.9910 1441.7507 1450.2819 1454.5990 1466.0155 1473.6718 1478.9981 1479.4579 1486.0158 1486.6511 1492.8518 1612.7204 1632.1633 2843.2421 2920.3290 2929.4702 2955.3080 2981.7069 2985.4741 2993.4497 3006.6961 3070.0565 3073.1598 3075.8662 3085.0721 3087.9281 3100.8973 3108.1376 3167.4781 3186.0847 3195.4791
redmass: 4.0995 4.5688 2.5909 3.3610 2.4187 3.8032 1.9865 1.3668 3.5936 4.6220 2.9408 3.8843 1.6900 3.8142 4.2543 3.2150 2.4699 2.1172 2.9905 2.8580 4.0769 6.0663 3.9480 5.8064 5.3952 4.9201 6.1533 8.9152 4.9255 3.6278 1.5806 2.9779 2.2997 2.1662 5.8505 2.2448 2.1763 2.9321 2.0754 1.9160 3.1303 1.7051 3.7495 1.7983 2.6385 3.2631 1.9946 2.4031 3.8090 1.9075 2.3008 1.5020 1.0862 1.3088 2.2381 1.7028 1.6472 1.4756 1.4232 3.6773 1.3121 1.5543 1.1947 1.6032 1.3248 1.3689 1.6210 1.3035 1.2843 1.2412 3.4367 1.2811 4.8451 1.0806 1.0801 1.0678 1.0692 1.6858 1.0598 1.5325 1.1439 1.0509 8.1338 8.3135 1.0803 1.0681 1.0679 1.0600 1.0376 1.0365 1.0618 1.0999 1.0973 1.0986 1.0968 1.0992 1.0945 1.0982 1.1091 1.0887 1.0966 1.0933
irintensity: 0.2857 1.0752 0.8538 3.3416 9.9633 2.5797 1.0971 0.3913 1.7835 1.7310 0.8400 3.5930 1.7424 0.2300 0.9029 1.5650 0.3825 3.0916 1.4605 2.6654 14.2798 0.9617 4.8005 3.0889 1.0131 10.2816 2.9016 1.6137 1.4057 10.3922 7.8861 20.5986 39.7615 43.6803 19.0257 26.3662 17.2159 45.1494 2.5295 1.4570 15.4069 9.7464 25.6636 24.8221 67.2923 126.9181 75.9939 44.1563 60.6736 3.4858 100.2358 7.6033 0.6025 6.8934 1.4804 11.7341 27.7575 2.6845 0.5654 155.9064 8.1729 24.7212 3.8553 57.5305 1.4662 0.8656 107.5899 0.5661 2.3473 18.8733 26.0243 16.2095 86.8513 5.7726 3.3957 3.4457 15.0324 37.6393 17.2304 61.8055 10.1786 4.9167 3.5918 1.1031 64.8940 22.7139 102.3302 61.3544 19.4462 35.9800 131.0792 25.8522 2.9849 22.0261 79.3924 46.8449 27.9328 17.3957 33.1635 2.1765 3.9352 1.8029
temp: 298.150 k
press: 1.00000 atm
elementType: 8 8 8 8 6 6 6 6 6 6 6 6 6 6 6 6 6 6 1 1 1 1 1 1 1 1 1 1 1 1 1 1 1 1 1 1
symmnumber: 1
zpe: 773845.6 jmol-1
zpe.correction: 0.294742 hartree
zpe.thermalcorrener: 0.311613 hartree
zpe.thermalcorrenthalpy: 0.312558 hartree
zpe.thermalcorrgfe: 0.249729 hartree
zpe.sumelectzpe: -843.770000 hartree
zpe.sumelectthermal: -843.753129 hartree
zpe.sumelectthermalent: -843.752185 hartree
zpe.sumelectthermalfe: -843.815014 hartree
dipole: -2.5563 -0.2668 -0.8581
dipole: 2.7097
quadrupole: -87.7266 -107.2965 -106.8703
quadrupole: -1.9226 5.5112 -0.9211
quadrupole: 12.9046 -6.6654 -6.2392 -1.9226 5.5112 -0.9211
hfenergy: -844.0647423 hartree
pointgroup: C01 [X(C14H18O4)]
dipole: 1.0001058 -0.3614649 0.0750591 debye
polarizability: 233.5133664|-8.0412647|116.8312387|12.1948618|17.5260538|139.3406944 unknown
InChI: InChI=1S/C14H18O4/c1-3-14(2)7-15-13(16-8-14)10-4-5-11-12(6-10)18-9-17-11/h4-6,13H,3,7-9H2,1-2H3
charge 0 multiplicity 1
36 atoms
O  1.454963 0.513923 1.133271
O  1.138612 -0.724712 -0.919357
O  -3.998396 -0.699294 -1.401146
O  -4.896133 0.593546 0.408245
C  3.466775 -0.048575 -0.257526
C  2.891615 0.164809 1.170785
C  2.563257 -1.113505 -0.943505
C  4.907416 -0.633831 -0.172761
C  3.417329 1.270939 -1.063218
C  0.696695 -0.542001 0.463574
C  5.963676 0.279193 0.490323
C  -0.773653 -0.178644 0.470177
C  -1.610958 -0.65483 -0.579103
C  -1.304204 0.584775 1.537506
C  -2.962985 -0.323922 -0.501965
C  -3.493062 0.437209 0.561788
C  -2.687214 0.906387 1.60134
C  -5.189567 0.065085 -0.950951
H  3.030448 -0.760085 1.777456
H  3.371216 1.011943 1.68583
H  2.813421 -1.22454 -2.011758
H  2.683343 -2.098168 -0.43513
H  5.240892 -0.878019 -1.202605
H  4.870782 -1.598166 0.377336
H  3.967929 2.078868 -0.548938
H  3.86588 1.134295 -2.065588
H  2.372564 1.599568 -1.191158
H  0.898449 -1.500528 1.009563
H  6.079264 1.231726 -0.056184
H  5.704226 0.517678 1.53795
H  6.949593 -0.220156 0.500801
H  -1.195308 -1.228993 -1.409108
H  -0.624393 0.949232 2.311834
H  -3.101522 1.497109 2.422021
H  -6.052372 -0.615665 -0.892021
H  -5.354276 0.916645 -1.638978
