program: Gaussian 09
title: 000019840
version: EM64L-G09RevD.01
frameworkgroup: C1[X(C9H14N2O)]
method: RPBEPBE
basis: SDD
operation: Freq
keyword: #p
keyword: freq=noraman
keyword: PBEPBE/SDD
title: #p freq=noraman PBEPBE/SDD
converged: YES YES NO NO
title: Mulliken charges:
elementType: O N N C C C C C C C C C H H H H H H H H H H H H H H
charge: -0.274930 -0.307649 -0.284023 -0.409009 -0.290714 0.365295 -0.351243 -0.377554 -0.223060 -0.196782 -0.257613 -0.632835 0.220530 0.228846 0.195712 0.227310 0.257606 0.247690 0.249335 0.273280 0.222325 0.226478 0.226943 0.214409 0.221911 0.227741
chargesum: 0.00000
title: Mulliken charges with hydrogens summed into heavy atoms:
elementType: O N N C C C C C C C C C
charge: -0.274930 -0.050043 -0.010743 0.040367 0.132307 0.365295 -0.103553 -0.128219 -0.000736 0.029696 -0.030670 0.031226
polarizability: 1.72818796e+02 -6.32349815e-01 1.09813988e+02 1.47340101e+00 8.31201073e-01 6.60199102e+01
1716.lowfreq: -0.0008 -0.0004 0.0004 4.9583 8.7841 18.5344 24.0224 39.9046 62.8634
frequency: 23.3985 39.6696 62.8302 75.1783 104.4119 151.1067 181.8312 231.3856 233.4235 257.3244 342.8586 412.9697 455.3866 481.0931 503.8796 584.6749 610.9593 692.8187 758.4845 759.0596 800.6395 820.0929 826.5145 845.8469 890.8935 951.8068 961.4940 979.7797 982.1958 991.7357 1023.3020 1042.8294 1080.3477 1082.8998 1086.6163 1106.6586 1122.7070 1161.5545 1167.0912 1179.2534 1221.3442 1252.1005 1268.9027 1313.9768 1317.7332 1378.6477 1392.3325 1404.9623 1422.3666 1444.0213 1452.0527 1474.2262 1485.4811 1488.8709 1493.2512 1497.0978 1592.1231 1613.0395 2919.1325 2950.0810 2960.4173 3022.7609 3024.7505 3053.4033 3086.1347 3127.1377 3135.9780 3154.8776 3163.3966 3172.3594 3339.3616 3361.3783
redmass: 2.8040 3.4922 3.5160 2.8892 2.6083 2.1119 3.9109 5.0674 4.8697 1.2168 3.6489 2.9380 3.7748 4.3489 2.8585 5.9927 6.4328 2.0426 2.9797 1.7764 3.7766 1.2529 1.2260 1.1884 1.4506 1.4142 1.3576 5.3737 1.2978 6.1330 2.0396 3.2770 1.9298 1.8567 2.8617 1.8997 1.5223 1.2351 1.0788 1.1657 3.5353 1.5631 1.1202 1.3350 1.2901 1.9712 2.3994 1.3624 1.1598 2.3744 1.0400 1.5856 1.2698 1.1568 1.0486 1.1082 6.4219 6.2588 1.0461 1.0596 1.0655 1.0979 1.0876 1.1014 1.0980 1.0847 1.0890 1.0925 1.0952 1.1005 1.0745 1.0751
irintensity: 2.9216 2.0809 0.1346 0.7219 7.3868 4.4880 0.9305 0.7837 0.3734 1.6419 6.5868 0.0541 0.2811 3.8675 12.2534 6.7882 0.6007 35.0650 23.4829 76.2773 14.0059 17.1325 112.8796 17.9156 8.2917 7.1153 0.1944 13.9330 0.6501 46.6135 24.3747 7.7781 13.0936 9.2704 14.1966 18.0692 1.9596 16.3778 6.6475 34.3253 233.3646 0.6308 0.9639 1.0276 0.3475 4.6132 29.3920 1.4529 0.5193 2.7347 14.7369 98.6753 39.6104 0.5672 9.7336 3.3178 24.2619 83.0589 111.4194 34.1049 52.0460 11.3348 48.1894 55.9758 28.2740 2.8974 12.6351 33.5158 22.7130 5.5359 0.9233 5.7216
temp: 298.150 k
press: 1.00000 atm
elementType: 8 7 7 6 6 6 6 6 6 6 6 6 1 1 1 1 1 1 1 1 1 1 1 1 1 1
symmnumber: 1
zpe: 574510.8 jmol-1
zpe.correction: 0.218820 hartree
zpe.thermalcorrener: 0.231389 hartree
zpe.thermalcorrenthalpy: 0.232333 hartree
zpe.thermalcorrgfe: 0.177842 hartree
zpe.sumelectzpe: -535.087066 hartree
zpe.sumelectthermal: -535.074497 hartree
zpe.sumelectthermalent: -535.073553 hartree
zpe.sumelectthermalfe: -535.128044 hartree
dipole: -1.3293 1.4546 -0.0099
dipole: 1.9705
quadrupole: -60.6669 -70.4860 -74.4813
quadrupole: -2.6295 1.4090 2.9838
quadrupole: 7.8778 -1.9412 -5.9366 -2.6295 1.4090 2.9838
hfenergy: -535.305886 hartree
pointgroup: C01[X(C9H14N2O1)]
dipole: 0.520023 0.5747948 -0.0138751 debye
dipolederiv: -1.9970868 0.0506787 -0.0234743 0.1437588 -0.3109873 0.0045598 -0.0384013 0.0030353 -0.2804239 -0.4648919 -0.0757463 -0.0207059 0.0246513 -0.3678036 -0.0628543 0.0339057 -0.0956496 -0.0816913 -0.3277356 -0.1475982 0.0385877 -0.1096959 -0.4126634 -0.0202483 0.1825087 -0.0560478 -0.0611803 0.317473 0.1189338 0.0141801 0.146348 0.2742576 0.0722994 -0.1138822 0.0275814 0.2604174 0.89514 0.1073382 0.0155326 0.4474957 0.2751731 -0.0051551 0.0174857 -0.0270189 0.3949591 1.6085231 -0.1894075 0.0220219 -0.5304871 0.1167136 -0.0065294 0.024432 -0.0025974 0.110637 -0.2904503 0.0008411 0.0008806 0.3916868 -0.1061979 0.0073377 -0.0004952 0.0017132 -0.217556 -0.4470862 0.0681006 -0.0034014 -0.1579347 0.0544663 -0.0028043 -0.0023448 0.0012977 -0.1923529 0.1500186 0.0734046 0.0051909 -0.0588927 0.1532159 -0.0009005 0.0049158 0.0019969 -0.1418564 0.1664576 -0.025773 0.0053014 0.0100653 0.1583628 0.0007033 0.0055998 -0.0002891 -0.1449383 -0.0532504 -0.0804966 0.0028381 -0.0235831 -0.2047745 -0.0005688 0.0022476 -0.0015967 -0.2040364 0.2025108 0.1264841 -0.0270048 0.2139788 0.3195206 0.0428407 -0.1604412 -0.0001092 0.218549 0.0592543 0.0057268 -0.0386205 -0.0164815 0.0070087 0.0758338 -0.0179787 0.1020565 -0.0880745 0.0095119 -0.0289036 0.0058257 -0.0909253 -0.0904053 -0.1182114 -0.0338665 -0.1455888 -0.0683591 -0.028791 0.0073276 -0.0223512 -0.1030308 -0.0448488 0.0993443 0.0223294 0.1180659 -0.1039369 -0.0046946 0.0219395 0.0313559 -0.0783986 -0.0396831 -0.0922311 0.0170219 -0.0985293 -0.0695376 0.129537 -0.0159698 0.0189674 -0.0047896 0.2025097 0.0427236 0.0514745 0.1227461 -0.033602 -0.0109707 -0.1007172 -0.0032876 -0.1216675 0.0174837 -0.0025172 -0.0040841 -0.0019902 0.1685463 0.0908764 0.0590259 -0.001452 0.047675 -0.0542199 0.0005043 -0.0013155 0.0007608 0.1719106 0.1010915 -0.0169532 0.0371829 0.0150779 0.2489499 -0.0004112 0.0369675 0.0884139 -0.0514472 0.0590181 0.0463461 -0.0015235 0.0699712 -0.1168417 0.0007655 -0.001369 0.0005699 0.1555737 -0.0371357 -0.1091505 -0.0034886 -0.1155811 -0.0213258 -0.0022524 -0.0036576 -0.0019794 0.1561082 -0.1265543 0.0559309 -0.0051903 0.0573867 0.070001 0.0008743 -0.0053375 0.0009775 0.1738629 0.0502639 -0.0101501 0.0265086 -0.179099 -0.2147128 -0.1195004 -0.0062018 -0.1365706 -0.0017978 0.0884907 -0.0067935 -0.0366917 -0.0681175 0.04991 0.0432444 0.0512426 0.0720925 -0.1732516 -0.1395194 0.0655813 -0.0371818 0.090589 0.0368911 0.0431532 -0.0607554 0.0266594 0.1034779 unknown
polarizability: 172.7637741|1.0662247|109.6810799|2.6441533|-2.6081001|66.2078406 unknown
InChI: InChI=1S/C9H14N2O/c1-10-11-7-8-12-9-5-3-2-4-6-9/h2-6,10-11H,7-8H2,1H3
charge 0 multiplicity 1
26 atoms
O  -0.167419 -0.761716 0.076493
N  3.365095 0.386406 0.12003
N  4.648496 -0.39612 0.251891
C  2.226003 -0.574914 0.13086
C  0.921122 0.227189 0.095201
C  -1.487229 -0.279925 0.054882
C  -1.838118 1.093573 0.049974
C  -2.495169 -1.276682 0.036033
C  -3.205661 1.456347 0.026477
C  -3.851443 -0.898048 0.012841
C  -4.216902 0.471421 0.00772
C  5.791743 0.5147 -0.007046
H  2.26537 -1.149475 1.074229
H  2.257818 -1.306084 -0.704607
H  0.866355 0.86298 -0.814713
H  0.843679 0.87691 0.988649
H  3.422758 0.816301 -0.822139
H  -1.071865 1.874402 0.066378
H  -2.192912 -2.328597 0.040182
H  4.669471 -0.676939 1.249274
H  -3.475807 2.51861 0.023426
H  -4.626008 -1.673035 -0.001391
H  -5.272374 0.762447 -0.010296
H  5.744082 1.470669 0.561981
H  5.83534 0.753386 -1.086296
H  6.723073 -0.017706 0.252766
