program: Gaussian 09
title: 000240109
version: EM64L-G09RevD.01
frameworkgroup: C1[X(C4H7N3O)]
method: RPBEPBE
basis: SDD
operation: Freq
keyword: #pfreq=noraman
keyword: PBEPBE/SDD
title: #p freq=noraman PBEPBE/SDD
converged: NO YES NO NO
title: Mulliken charges:
elementType: O N N N C C C C H H H H H H H
charge: -0.249296 -0.373316 -0.077136 -0.606791 -0.489771 -0.366278 0.198645 0.052236 0.261163 0.215222 0.225903 0.225994 0.327020 0.340229 0.316175
chargesum: 0.00000
title: Mulliken charges with hydrogens summed into heavy atoms:
elementType: O N N N C C C C
charge: -0.249296 -0.046295 -0.077136 0.049613 -0.013386 0.085619 0.198645 0.052236
polarizability: 9.27586243e+01 3.71444783e+00 6.95400038e+01 -1.06890056e+00 6.76207903e-01 3.91806574e+01
1716.lowfreq: -3.0348 -0.4116 -0.0007 0.0001 0.0008 15.6559 106.4835 171.0566 231.2673
frequency: 106.4538 171.0534 231.2665 333.3064 411.2330 443.3260 481.9011 504.4901 543.6272 551.1537 638.6884 683.0439 732.2605 770.8591 870.0968 921.6670 961.1378 1051.6831 1075.7019 1131.1998 1196.8720 1219.0982 1267.5535 1303.3014 1351.0542 1398.6292 1415.4794 1441.4626 1486.4017 1581.1879 1612.6938 1644.3091 2943.2345 2998.0455 3051.5524 3067.1548 3531.9574 3568.0828 3693.0786
redmass: 3.5470 7.2976 2.1788 3.5181 1.2653 2.0234 4.3243 3.9847 1.3945 1.9323 1.6010 3.6321 9.6865 2.7806 2.7220 2.6796 2.3279 1.9409 1.7325 2.4068 1.2701 1.5883 3.0068 1.3105 1.5465 2.2314 2.2517 1.1114 1.0915 2.3943 2.4073 3.6268 1.0699 1.0604 1.0931 1.1026 1.0457 1.0776 1.1038
irintensity: 0.1189 8.6877 0.9749 3.0606 122.9521 30.2385 2.9473 2.3196 165.5057 10.5782 90.5411 14.4492 30.1232 1.8915 2.4574 5.1095 26.3037 14.1406 31.8505 3.3851 29.2471 25.7052 208.7491 5.4868 34.4476 69.2982 5.7480 23.5494 14.7075 171.1107 681.4271 156.5451 70.1183 18.1870 34.6231 26.5931 69.7588 23.5088 35.2889
temp: 298.150 k
press: 1.00000 atm
elementType: 8 7 7 7 6 6 6 6 1 1 1 1 1 1 1
symmnumber: 1
zpe: 313333.7 jmol-1
zpe.correction: 0.119342 hartree
zpe.thermalcorrener: 0.126588 hartree
zpe.thermalcorrenthalpy: 0.127532 hartree
zpe.thermalcorrgfe: 0.087960 hartree
zpe.sumelectzpe: -395.505097 hartree
zpe.sumelectthermal: -395.497852 hartree
zpe.sumelectthermalent: -395.496907 hartree
zpe.sumelectthermalfe: -395.536480 hartree
dipole: 6.0197 5.1332 -0.0354
dipole: 7.9112
quadrupole: -42.2407 -47.0299 -47.9950
quadrupole: -10.4762 0.8650 0.4471
quadrupole: 3.5145 -1.2747 -2.2398 -10.4762 0.8650 0.4471
hfenergy: -395.6244397 hartree
pointgroup: C01 [X(C4H7N3O1)]
dipole: 2.4451459 -1.9257269 -0.0247515 debye
dipolederiv: -1.1484805 0.3826853 -0.0508419 0.2266897 -0.7690309 0.0484354 -0.052095 0.0573977 -0.4029868 -0.4835701 0.0222245 -0.0114034 0.0194782 -1.066397 0.0678521 0.0213323 -0.082423 -0.5196859 -1.6753241 -0.23581 0.0010947 0.1550414 -0.5039398 -0.0364734 0.0179513 -0.0324625 -0.3166495 -1.2903939 -0.2813189 -0.0337281 -0.5571513 -0.3915489 0.0867085 -0.0971921 0.0625689 -0.6795428 -0.0204445 0.0079843 0.0764247 -0.095263 -0.1789256 -0.0707751 0.0691678 -0.1071991 0.1101098 0.3246273 -0.2279087 0.1260072 -0.0669625 0.2944648 -0.0522633 0.045721 -0.0222729 0.3966855 1.8714462 0.208289 -0.0429728 0.056182 0.5497577 0.1349423 -0.0117984 0.1365584 0.1883817 1.901345 -0.1090047 0.0750368 0.0740904 1.6410865 -0.0861038 0.1037748 -0.0299882 0.2669513 0.0802435 -0.0232987 -0.0249652 0.0128094 0.0398938 0.0114737 0.0286135 -0.0086142 -0.095517 -0.1190364 0.1024323 -0.0460332 0.073038 0.0272414 -0.0002007 -0.0686206 0.045347 0.0869422 0.0553206 -0.0299623 -0.0235733 -0.0058838 -0.1578836 -0.0462631 -0.0210326 -0.0880373 0.0636065 -0.0150533 0.1024847 -0.0551557 0.0226554 0.0325647 0.0120322 -0.0593116 0.1164978 -0.1891996 0.1141366 0.0164793 -0.0101096 0.001981 0.1272488 0.0143592 0.0053767 0.0362479 0.3557662 0.1858499 0.0244788 0.010499 0.0611803 0.1904709 -0.0380344 0.0134375 -0.0446789 0.3724644 0.2193336 0.040245 0.0097209 0.0221147 0.1649972 -0.0456895 0.0046756 -0.0389418 0.362674 unknown
polarizability: 93.0241969|-2.8028007|69.2659801|0.6348104|1.0750578|39.1891086 unknown
InChI: InChI=1S/C4H7N3O/c5-3-1-2-6-4(8)7-3/h6H,1-2,5H2
charge 0 multiplicity 1
15 atoms
O  -2.286572 1.092461 -0.104831
N  -1.230239 -0.971749 0.018931
N  0.053751 1.068214 0.159169
N  2.373642 1.002209 0.089711
C  1.17558 -1.114785 -0.406009
C  -0.035423 -1.78776 0.277607
C  1.158743 0.366752 -0.031656
C  -1.216061 0.433407 0.015191
H  1.087439 -1.209798 -1.505167
H  2.116404 -1.601698 -0.092771
H  -0.188472 -2.803186 -0.128548
H  0.16141 -1.885045 1.36745
H  -2.153297 -1.405576 -0.009334
H  2.371723 2.000499 0.2989
H  3.25417 0.511354 -0.037041
