program: Gaussian 09
title: 000240116
version: EM64L-G09RevD.01
frameworkgroup: C1[X(C12H24O3)]
method: RPBEPBE
basis: SDD
operation: Freq
keyword: #pfreq=noraman
keyword: PBEPBE/SDD
title: #p freq=noraman PBEPBE/SDD
converged: YES YES NO NO
title: Mulliken charges:
elementType: O O O C C C C C C C C C C C C H H H H H H H H H H H H H H H H H H H H H H H H
charge: -0.467614 -0.248699 -0.307212 -0.008762 -0.121443 -0.393543 -0.109480 -0.774166 -0.476375 -0.335401 0.387445 -0.533692 -0.507294 -0.788506 -0.806395 0.202138 0.240982 0.239283 0.200829 0.255842 0.241715 0.222523 0.210281 0.185921 0.227637 0.213777 0.353225 0.235662 0.213274 0.233425 0.211854 0.232615 0.235723 0.213172 0.226553 0.215270 0.247185 0.214853 0.217399
chargesum: 0.00000
title: Mulliken charges with hydrogens summed into heavy atoms:
elementType: O O O C C C C C C C C C C C C
charge: -0.114389 -0.248699 -0.307212 0.193377 0.119539 0.046569 0.146362 -0.099648 -0.062817 -0.121623 0.387445 0.148668 0.172898 -0.133512 -0.126958
polarizability: 1.72867565e+02 5.08081752e+00 1.36605977e+02 -2.63330000e+00 -6.21404994e+00 1.21237245e+02
1716.lowfreq: -26.6127 -4.9754 0.0007 0.0008 0.0010 2.1600 11.4425 30.4149 37.0655
frequency: -23.5916 30.2953 36.4983 54.7343 70.2206 99.0084 100.3459 114.7896 123.2078 138.3358 157.3400 162.3979 178.2864 197.4860 207.1460 233.8847 269.9438 284.9534 294.7285 302.0070 307.5891 356.2122 394.7954 408.5092 427.8569 479.9260 497.4065 543.2921 568.5067 577.8220 614.0781 753.1551 793.4658 813.1287 843.5845 858.7625 883.2055 931.8548 945.5860 953.4833 957.1617 991.3989 998.5898 1004.2178 1032.4494 1037.3594 1080.9796 1081.9202 1087.6894 1101.8177 1113.4794 1117.6631 1126.7622 1139.4297 1148.6866 1161.4442 1178.0424 1228.0029 1243.1549 1256.0660 1277.7888 1290.7952 1302.3417 1327.3575 1330.7245 1348.0170 1352.3831 1357.7954 1381.5632 1386.8493 1387.7592 1397.9088 1422.3724 1431.2596 1454.1282 1455.8330 1457.4102 1462.4449 1469.2773 1470.6613 1471.9677 1475.8434 1480.2586 1481.2553 1489.0727 1490.6497 1692.1314 2953.8066 2956.6837 2958.1662 2959.6569 2961.0687 2966.2881 2972.7412 2980.8002 2983.8906 3024.4885 3026.5779 3028.6263 3033.0427 3054.9171 3057.7565 3059.4528 3072.4212 3073.0893 3078.5699 3087.2354 3092.8093 3110.8425 3116.5213 3514.5266
redmass: 3.1216 3.2494 3.6776 3.2746 3.3222 2.5960 2.3583 1.1782 2.8373 1.7198 1.2133 1.8324 1.4541 1.4195 1.2779 2.9083 3.1607 2.3759 3.1465 2.5006 3.4648 2.9248 2.6721 3.4738 3.0011 2.3058 1.2151 3.0176 2.4982 3.3743 3.4917 1.8561 2.1636 1.8942 1.7417 5.1336 3.5751 1.7597 1.6203 1.8830 1.7427 1.2477 9.0822 2.1251 3.2101 3.9917 1.8768 2.4015 1.5804 2.0779 1.3212 1.3040 2.2244 1.8665 1.4213 1.5420 1.8050 1.5592 1.4479 1.2987 1.2122 1.2874 1.2821 1.1667 1.2880 1.4003 1.4229 1.2727 1.4169 1.3074 1.3916 1.2467 1.1248 1.1408 1.0648 1.0585 1.0523 1.0677 1.0567 1.0513 1.0762 1.0511 1.0525 1.0523 1.0521 1.0821 6.4060 1.0373 1.0707 1.0644 1.0348 1.0413 1.0479 1.0712 1.0532 1.0475 1.0970 1.0861 1.0962 1.0907 1.1002 1.0998 1.1022 1.0964 1.0987 1.0933 1.1002 1.0963 1.1016 1.1017 1.0648
irintensity: 0.3124 0.1595 0.3251 1.0807 0.4843 4.2228 0.1751 0.1632 2.1607 1.2796 1.1420 1.5880 1.0703 3.0910 0.3984 9.0171 15.2470 4.7762 8.5151 3.0898 2.3124 1.3512 0.8833 12.9237 6.2053 4.8437 126.7243 25.3974 10.9750 3.1001 3.2191 4.5684 15.9607 9.4950 23.5967 11.3428 43.0882 23.9949 9.1621 25.1299 13.5716 5.2364 180.3854 25.3898 17.2214 48.9849 21.8690 68.5649 5.6498 6.3306 1.9159 0.5649 21.6547 10.0714 1.3403 11.8930 5.3857 34.2394 8.2213 4.3115 1.3844 8.5064 5.5374 0.9001 2.9912 9.1542 1.4903 2.6286 6.5546 19.8602 22.2716 13.4249 6.5378 4.8325 2.8062 4.5185 10.1035 6.1349 1.3892 24.0989 8.3030 18.2529 3.1321 18.4204 10.7480 7.7192 2.9147 44.5733 21.3330 38.2887 69.8223 37.2118 13.1494 104.4851 18.3354 39.2200 5.6502 41.6002 58.6314 11.1196 29.8714 20.9102 53.9923 0.5461 48.0059 77.3494 33.2152 30.6546 28.3003 22.1233 20.3867
temp: 298.150 k
press: 1.00000 atm
elementType: 8 8 8 6 6 6 6 6 6 6 6 6 6 6 6 1 1 1 1 1 1 1 1 1 1 1 1 1 1 1 1 1 1 1 1 1 1 1 1
symmnumber: 1
zpe: 894591.2 jmol-1
zpe.correction: 0.340732 hartree
zpe.thermalcorrener: 0.359780 hartree
zpe.thermalcorrenthalpy: 0.360724 hartree
zpe.thermalcorrgfe: 0.293019 hartree
zpe.sumelectzpe: -696.044146 hartree
zpe.sumelectthermal: -696.025099 hartree
zpe.sumelectthermalent: -696.024154 hartree
zpe.sumelectthermalfe: -696.091859 hartree
dipole: -1.7157 0.7460 1.1665
dipole: 2.2047
quadrupole: -85.2143 -92.3899 -93.2016
quadrupole: -5.4281 -0.8430 -1.5922
quadrupole: 5.0543 -2.1213 -2.9330 -5.4281 -0.8430 -1.5922
hfenergy: -696.3848782 hartree
pointgroup: C01 [X(C12H24O3)]
dipole: -0.673084 -0.3610418 -0.4111126 debye
polarizability: 172.4985035|-5.0617583|133.9680033|4.4680498|-8.7924348|124.2442798 unknown
InChI: InChI=1S/C12H24O3/c1-9(2)7-6-8-10(3)11(13)12(14-4)15-5/h7,10-13H,6,8H2,1-5H3
charge 0 multiplicity 1
39 atoms
O  -0.73275 -0.796935 1.389412
O  -3.19964 0.776046 -0.999981
O  -3.094851 -1.358481 0.141814
C  -0.41403 1.342619 0.248587
C  -1.117213 -0.033617 0.189703
C  1.12614 1.169636 0.355645
C  -2.657653 0.04397 0.133333
C  -0.934972 2.224579 1.408976
C  1.772242 0.317533 -0.77264
C  3.288355 0.340172 -0.713479
C  4.100797 -0.581835 -0.119315
C  -2.784033 0.280878 -2.326041
C  -4.532178 -1.517125 0.41073
C  5.612352 -0.412963 -0.123103
C  3.59971 -1.827498 0.592331
H  -0.640743 1.85465 -0.711217
H  -0.777438 -0.583278 -0.713868
H  1.367929 0.706996 1.330382
H  1.588808 2.177224 0.35194
H  -3.076527 0.57322 1.010326
H  -0.876129 1.672939 2.364058
H  -1.979492 2.546991 1.248145
H  -0.317543 3.136849 1.500085
H  1.440821 0.711885 -1.756648
H  1.401846 -0.721091 -0.703603
H  3.767134 1.218432 -1.174832
H  -1.309706 -1.606521 1.396097
H  -2.845966 -0.822139 -2.372911
H  -1.757112 0.609151 -2.577743
H  -3.494042 0.727454 -3.03935
H  -4.787851 -1.135255 1.419868
H  -4.735477 -2.597749 0.357938
H  -5.133591 -0.97998 -0.345371
H  6.109432 -1.28348 -0.596805
H  5.92223 0.496293 -0.667605
H  6.008695 -0.347241 0.910214
H  2.500294 -1.884461 0.642126
H  3.974164 -2.743888 0.092899
H  3.983292 -1.85648 1.631802
