program: Gaussian 09
title: 000240177
version: EM64L-G09RevD.01
frameworkgroup: C1[X(C22H15N5O6)]
method: RPBEPBE
basis: SDD
operation: Freq
keyword: #p
keyword: freq=noraman
keyword: PBEPBE/SDD
title: #p freq=noraman PBEPBE/SDD
converged: YES YES NO NO
title: Mulliken charges:
elementType: O O O O O O N N N N N C C C C C C C C C C C C C C C C C C C C C C H H H H H H H H H H H H H H H
charge: -0.182083 -0.166163 -0.254656 -0.171226 -0.195392 -0.198312 -0.268444 -0.398045 0.014648 -0.002054 0.013969 0.390980 0.415513 0.223980 -0.579115 0.371412 0.377071 -0.372036 -0.428122 0.299688 0.398952 -0.422704 -0.403571 -0.567800 -0.543360 -0.370895 -0.316078 0.496315 -0.240807 -0.238653 -0.215614 -0.232017 -0.244390 0.370156 0.251496 0.284739 0.246012 0.244761 0.244622 0.341614 0.322777 0.267118 0.265368 0.234246 0.233770 0.232114 0.234437 0.235779
chargesum: 0.00000
title: Mulliken charges with hydrogens summed into heavy atoms:
elementType: O O O O O O N N N N N C C C C C C C C C C C C C C C C C C C C C C
charge: -0.182083 -0.166163 -0.254656 -0.171226 -0.195392 -0.198312 -0.268444 -0.027889 0.014648 -0.002054 0.013969 0.390980 0.415513 0.223980 -0.327619 0.371412 0.377071 -0.087297 -0.182110 0.299688 0.398952 -0.177943 -0.158949 -0.226186 -0.220583 -0.103777 -0.050709 0.496315 -0.006561 -0.004883 0.016500 0.002420 -0.008611
polarizability: 4.73134765e+02 -3.94098624e+01 3.81682532e+02 -2.16988338e+01 -5.51144793e+00 2.83166258e+02
1716.lowfreq: -2.5316 -0.0006 -0.0003 0.0003 0.6611 5.1777 14.1071 18.8427 26.9367
frequency: 13.9871 18.7362 26.9305 39.9026 49.8930 60.7911 62.9418 68.5873 82.6233 87.7441 107.8701 120.6790 143.1621 161.6113 177.7482 184.0519 190.5833 197.7199 208.0995 259.5739 279.6605 295.8045 308.8628 317.6169 341.7697 355.9609 367.5769 393.9577 400.3083 410.2738 415.8874 447.8339 477.5668 493.4815 506.6304 509.6037 518.0694 526.2504 541.4761 550.4080 581.0632 611.1904 623.3460 631.3373 640.2188 666.4293 668.3627 673.7306 685.9711 693.6732 699.4436 713.9933 736.1151 737.5452 758.0917 760.8256 762.7712 778.3338 790.4750 808.0375 817.5718 830.8443 837.9783 869.1508 888.4536 899.8068 903.5276 910.8898 922.5891 947.7112 962.8579 965.7069 971.6587 971.8061 983.2654 985.2833 993.3317 995.2688 1023.6809 1027.3036 1067.6687 1084.8243 1097.8552 1125.4750 1130.3982 1162.1428 1165.8045 1170.2469 1175.1144 1175.6761 1190.0602 1202.8708 1207.7536 1231.6478 1238.6103 1254.4370 1275.3357 1277.8773 1298.4566 1326.3702 1334.1620 1354.1811 1360.2696 1376.7528 1380.9245 1386.9727 1411.9292 1424.1461 1438.8272 1439.2663 1447.9328 1462.3017 1474.9831 1479.7494 1495.9573 1512.8961 1575.3056 1580.9704 1589.0112 1601.2634 1604.6020 1614.5238 1636.8342 3124.4966 3129.2359 3131.8764 3135.4540 3136.0762 3145.1663 3147.2437 3160.8405 3166.2113 3168.8099 3171.0878 3181.3167 3181.8541 3185.6691 3243.8427
redmass: 9.4793 8.0793 6.2186 6.6630 6.3625 9.8387 6.0422 6.9957 12.0638 6.9993 8.9664 6.8624 10.3937 8.5735 9.6807 5.7336 6.3406 3.8953 6.5511 6.8886 5.5027 6.0477 11.7077 8.5965 5.4156 7.6898 10.4036 6.9612 3.3357 3.1062 6.6030 4.7412 2.6960 4.3544 5.4453 5.9312 6.9522 4.4301 6.0502 5.2316 6.2353 6.5097 6.8673 6.2284 7.4862 4.2856 7.7320 9.2524 4.5512 2.7911 5.7465 3.3921 6.5877 12.1545 1.7620 2.6328 1.6813 2.6041 1.4220 5.7153 4.2869 1.4467 1.2593 1.4905 6.6143 7.4636 1.7572 1.4691 5.3134 1.4673 1.3933 3.5823 1.4451 1.4108 1.3667 5.2701 1.3296 1.3459 2.3165 2.1136 2.0645 1.8511 1.8865 6.6137 1.8500 1.2341 4.4591 2.0209 1.0519 1.1137 1.1362 2.6480 4.2672 6.9250 2.5139 2.1892 3.0393 1.7710 2.3016 1.4236 4.8324 4.4618 1.9678 9.9448 9.1524 8.7248 5.5491 3.4877 4.4915 5.1390 2.4303 2.4786 2.5276 2.8149 3.1204 3.6919 5.6826 7.2647 6.5253 5.6962 6.1918 8.1418 6.7601 1.0864 1.0895 1.0910 1.0856 1.0888 1.0895 1.0947 1.0936 1.1003 1.0965 1.0967 1.0976 1.0930 1.0923 1.0807
irintensity: 0.0809 0.1489 0.8677 0.3307 0.2884 0.2008 0.1874 0.1399 1.6328 0.9515 4.8481 2.0998 2.7395 0.9261 3.2251 0.7639 1.7500 1.5245 2.3001 1.8184 1.0020 1.5547 0.3589 0.3605 1.5311 0.7594 0.7072 2.4077 1.2280 2.9586 6.1218 13.0315 21.6448 2.5051 4.1261 1.6855 7.9625 0.3304 7.4506 13.3447 4.7967 0.1293 1.3428 6.9585 15.9031 9.2246 7.6649 13.3073 13.3343 20.0019 15.1674 57.0660 21.3226 1.8843 23.0221 22.9937 78.8356 1.2253 142.4364 12.1283 3.2114 16.0031 9.3824 30.9775 11.1473 11.2137 8.5678 5.5876 0.8588 10.5497 2.6383 3.8260 5.8925 17.7634 3.1589 0.4916 0.7204 0.1222 7.5257 6.5504 42.2013 8.8463 2.5383 117.1840 1.3315 6.8585 274.7757 58.3384 0.4345 4.1127 7.2535 167.6607 378.2964 163.0315 40.7390 34.0131 91.1044 12.9230 109.3354 13.3785 66.8471 140.0167 11.4971 38.7490 119.5726 12.7494 5.7113 1.3050 1.4407 1.7325 2.1851 16.2947 106.8751 21.1546 10.6081 25.8238 63.0600 5.6675 11.0049 49.2063 61.5107 101.9229 18.2540 2.7300 0.9974 8.4607 2.6458 6.4073 7.8507 24.0630 31.0514 33.8558 1.6913 21.1435 7.2266 17.1698 27.5775 99.0804
temp: 298.150 k
press: 1.00000 atm
elementType: 8 8 8 8 8 8 7 7 7 7 7 6 6 6 6 6 6 6 6 6 6 6 6 6 6 6 6 6 6 6 6 6 6 1 1 1 1 1 1 1 1 1 1 1 1 1 1 1
symmnumber: 1
zpe: 889444.1 jmol-1
zpe.correction: 0.338771 hartree
zpe.thermalcorrener: 0.365671 hartree
zpe.thermalcorrenthalpy: 0.366615 hartree
zpe.thermalcorrgfe: 0.278817 hartree
zpe.sumelectzpe: -1569.884707 hartree
zpe.sumelectthermal: -1569.857807 hartree
zpe.sumelectthermalent: -1569.856863 hartree
zpe.sumelectthermalfe: -1569.944661 hartree
dipole: 6.2214 0.9279 0.4805
dipole: 6.3085
quadrupole: -207.2111 -167.3606 -209.1741
quadrupole: 4.0436 -3.9003 1.7049
quadrupole: -12.6292 27.2214 -14.5922 4.0436 -3.9003 1.7049
hfenergy: -1570.2234782 hartree
pointgroup: C01 [X(C22H15N5O6)]
dipole: 2.2022817 -1.0823093 0.3724735 debye
polarizability: 476.7236298|14.5915331|360.2388133|47.8306697|-24.2630664|301.0211111 unknown
InChI: InChI=1S/C22H15N5O6/c28-25(29)19-13-20(26(30)31)22(21(14-19)27(32)33)23-24(17-8-2-1-3-9-17)18-11-10-15-6-4-5-7-16(15)12-18/h1-14,23H
charge 0 multiplicity 1
48 atoms
O  -2.152539 0.998919 -4.162013
O  -0.394677 0.976132 2.719805
O  0.039783 1.147915 -3.5456
O  0.48882 2.753744 1.581989
O  -5.725404 1.588809 -1.01486
O  -5.283772 1.688787 1.227902
N  1.511067 0.486781 -0.042223
N  0.662869 1.015289 -1.031304
N  -1.24514 1.141384 -3.259957
N  -0.280585 1.722231 1.677983
N  -4.915986 1.601473 -0.008737
C  1.253461 -0.874354 0.380383
C  0.390221 -3.137193 -0.039161
C  -0.664971 1.277684 -0.791666
C  0.679406 -1.808668 -0.488261
C  0.716623 -3.510888 1.322778
C  2.805231 1.106531 0.050649
C  1.563079 -1.233358 1.735901
C  1.30671 -2.525692 2.183513
C  -1.642623 1.292117 -1.860651
C  -1.195645 1.468432 0.531292
C  -0.201214 -4.11615 -0.904917
C  0.434206 -4.8428 1.767674
C  -3.024119 1.40592 -1.604971
C  -2.55765 1.552171 0.800416
C  3.960711 0.332981 0.340346
C  2.925593 2.503912 -0.17463
C  -3.47014 1.508559 -0.283126
C  -0.46223 -5.40856 -0.444022
C  -0.144303 -5.775528 0.902818
C  5.219603 0.962805 0.416477
C  4.193863 3.114827 -0.109437
C  5.346855 2.353602 0.191335
H  0.956382 1.022208 -2.028714
H  0.449428 -1.538796 -1.525555
H  1.97811 -0.479507 2.410939
H  1.536421 -2.79506 3.220605
H  -0.446672 -3.837263 -1.936533
H  0.678151 -5.120671 2.799802
H  -3.733265 1.392787 -2.437013
H  -2.927247 1.6815 1.821502
H  3.879347 -0.74772 0.486689
H  2.033984 3.100967 -0.381313
H  -0.914529 -6.149022 -1.112383
H  -0.358216 -6.79161 1.251106
H  6.106643 0.359319 0.63741
H  4.277566 4.1930 -0.282338
H  6.328791 2.834658 0.245673
