program: Gaussian 09
title: 000240107
version: EM64L-G09RevD.01
frameworkgroup: C1[X(C11H18N2O2)]
method: RPBEPBE
basis: SDD
operation: Freq
keyword: #p
keyword: freq=noraman
keyword: PBEPBE/SDD
title: #p freq=noraman PBEPBE/SDD
converged: YES YES NO NO
title: Mulliken charges:
elementType: O O N N C C C C C C C C C C C H H H H H H H H H H H H H H H H H H
charge: -0.279669 -0.228020 -0.179683 -0.402833 -0.000551 -0.415210 -0.415054 -0.392250 -0.396588 -0.391045 -0.385810 -0.183466 0.198383 0.145457 -0.702004 0.256163 0.179862 0.218970 0.219478 0.190547 0.202540 0.202830 0.203264 0.202223 0.206003 0.188410 0.226660 0.232820 0.260509 0.352638 0.208831 0.260254 0.216339
chargesum: 0.00000
title: Mulliken charges with hydrogens summed into heavy atoms:
elementType: O O N N C C C C C C C C C C C
charge: -0.279669 -0.228020 -0.179683 -0.050196 0.255613 -0.016379 -0.005029 0.013120 0.008900 0.003368 0.073670 0.077043 0.198383 0.145457 -0.016579
polarizability: 1.69152978e+02 3.71952005e+00 1.30695418e+02 3.74135602e-01 4.87194908e-01 1.02624167e+02
1716.lowfreq: -18.6005 -8.3425 -0.0007 0.0004 0.0005 9.6660 35.4065 47.3419 70.9257
frequency: 32.9997 47.0076 70.9141 86.7907 158.9846 181.5281 186.0918 214.2130 219.7928 230.3753 273.0174 327.7584 351.5300 368.4158 385.0123 425.8092 438.1225 452.5322 474.7926 545.0293 591.4231 658.5232 686.4177 717.0233 733.3162 761.8632 784.5689 785.9245 827.9590 854.6437 889.8390 894.5438 909.8209 917.8707 949.6751 994.7085 1046.2160 1056.7653 1058.1407 1073.0187 1087.3630 1111.1219 1115.8163 1148.8086 1152.4472 1176.0665 1193.1203 1225.0615 1247.3364 1253.9649 1258.3893 1260.6806 1274.1825 1307.5114 1317.5233 1326.2659 1333.8791 1340.0060 1343.0963 1345.0488 1354.0427 1357.7317 1372.3148 1393.2658 1419.2887 1460.3174 1462.8948 1464.9131 1468.7604 1471.3199 1478.3234 1479.9513 1485.8242 1631.9311 1648.3455 2949.2593 2961.5594 2964.6611 2966.3622 2973.3872 2973.9758 2974.5024 2993.2411 3016.2710 3032.0322 3033.2703 3038.7882 3040.2972 3050.5354 3064.9117 3085.8641 3110.1075 3524.0150
redmass: 3.6150 4.6939 3.6284 3.8311 6.5621 1.1375 2.4486 1.8523 2.7075 4.5503 3.1502 1.8765 2.3631 5.3556 5.3880 4.7735 3.4743 3.5402 1.8393 3.5187 3.8231 2.8163 3.6850 5.4406 3.3842 1.7979 1.4626 2.3194 3.1860 1.7324 2.0378 1.5745 1.4649 1.8403 1.6798 2.3222 1.8132 1.9456 1.2578 1.3624 2.1960 2.5756 2.8018 1.7840 2.6289 2.8004 1.5444 2.3283 1.7229 1.4840 1.2903 1.3646 1.4166 1.3271 1.4406 1.4468 1.3577 1.4618 1.4984 1.3627 2.2010 1.5625 1.6971 1.2279 2.1473 1.0908 1.0912 1.0882 1.0507 1.0817 1.0928 1.0648 1.1108 11.3357 5.2852 1.0703 1.0639 1.0642 1.0653 1.0774 1.0638 1.0622 1.0366 1.0844 1.0965 1.0947 1.1012 1.1005 1.1017 1.0935 1.1002 1.0991 1.0766
irintensity: 1.4784 0.1396 0.4899 0.1042 6.9830 0.2946 0.5508 0.4200 3.6970 3.9411 2.7894 0.7062 2.3100 10.7169 12.9489 15.3830 2.9794 2.2450 2.0003 9.5469 3.0003 15.0355 5.9579 4.3041 4.1089 103.9918 0.1429 10.7922 2.3439 4.3496 1.5065 17.7803 6.3525 0.6193 0.8417 15.2944 1.1072 12.9148 2.6756 1.8057 1.1853 0.2679 0.3094 7.5930 8.9980 42.4701 1.2497 278.1831 78.5647 9.3603 1.1358 6.4104 5.7565 1.4656 103.9706 2.2306 0.3900 0.3283 3.5053 0.6658 48.6682 10.1207 10.6136 27.5119 154.3002 2.0640 5.4801 9.7318 7.7962 22.6903 2.8668 9.0272 24.2756 282.5116 430.2158 16.0795 18.9734 32.5413 39.6300 48.2550 13.7173 29.8785 27.4092 31.7966 81.9550 55.5936 2.7076 5.8360 92.7023 19.3825 34.4779 11.4198 49.5115
temp: 298.150 k
press: 1.00000 atm
elementType: 8 8 7 7 6 6 6 6 6 6 6 6 6 6 6 1 1 1 1 1 1 1 1 1 1 1 1 1 1 1 1 1 1
symmnumber: 1
zpe: 742778.9 jmol-1
zpe.correction: 0.282910 hartree
zpe.thermalcorrener: 0.297329 hartree
zpe.thermalcorrenthalpy: 0.298274 hartree
zpe.thermalcorrgfe: 0.241108 hartree
zpe.sumelectzpe: -688.799044 hartree
zpe.sumelectthermal: -688.784624 hartree
zpe.sumelectthermalent: -688.783680 hartree
zpe.sumelectthermalfe: -688.840845 hartree
dipole: 3.5221 -3.8212 -0.4099
dipole: 5.2129
quadrupole: -104.0866 -95.9068 -88.8176
quadrupole: 0.3112 0.2870 -1.2611
quadrupole: -7.8163 0.3635 7.4527 0.3112 0.2870 -1.2611
hfenergy: -689.0819534 hartree
pointgroup: C01 [X(C11H18N2O2)]
dipole: 1.4195043 -1.4783319 -0.0759875 debye
polarizability: 168.9560895|4.6070904|130.8296788|-0.5267153|-1.4173981|102.6867956 unknown
InChI: InChI=1S/C11H18N2O2/c1-8-7-13(11(15)12-10(8)14)9-5-3-2-4-6-9/h8-9,12H,2-7H2,1H3
charge 0 multiplicity 1
33 atoms
O  -0.388999 2.605215 -0.001204
O  -4.252877 0.038083 0.087523
N  -0.108848 0.266511 -0.06045
N  -2.275027 1.236304 -0.125947
C  1.376467 0.365323 -0.001511
C  1.95064 -0.366842 1.236972
C  2.041491 -0.129163 -1.311623
C  3.489971 -0.210003 1.300664
C  3.580259 0.025839 -1.238341
C  4.163081 -0.701038 -0.00295
C  -0.758841 -1.029228 -0.354847
C  -2.109826 -1.172505 0.378265
C  -0.857663 1.43025 -0.058596
C  -2.992507 0.052518 0.095516
C  -2.83488 -2.480028 0.008651
H  1.584749 1.446912 0.105329
H  1.702104 -1.447958 1.190582
H  1.481005 0.039078 2.152602
H  1.636122 0.441703 -2.168582
H  1.795154 -1.198174 -1.480105
H  3.886967 -0.764304 2.172518
H  3.740503 0.858758 1.460153
H  3.8361 1.103649 -1.182104
H  4.039977 -0.362889 -2.167138
H  5.257259 -0.542985 0.050591
H  4.001949 -1.794058 -0.110294
H  -0.083822 -1.840171 -0.033692
H  -0.921049 -1.145072 -1.448116
H  -1.913418 -1.161112 1.471635
H  -2.815489 2.101319 -0.227611
H  -2.26436 -3.358158 0.360081
H  -3.837474 -2.499299 0.465334
H  -2.966718 -2.562777 -1.085507
