program: Gaussian 09
title: 000240115
version: EM64L-G09RevD.01
frameworkgroup: C1[X(C11H13N3O6)]
method: RPBEPBE
basis: SDD
operation: Freq
keyword: #p
keyword: freq=noraman
keyword: PBEPBE/SDD
title: #p freq=noraman PBEPBE/SDD
converged: YES YES NO NO
title: Mulliken charges:
elementType: O O O O O O N N N C C C C C C C C C C C H H H H H H H H H H H H H
charge: -0.164995 -0.153133 -0.174672 -0.161397 -0.178325 -0.179051 -0.029792 -0.015386 0.010056 0.138047 0.271545 -0.714203 -0.720561 -0.719078 0.135371 0.285030 0.203396 0.285394 -0.580920 -0.759516 0.220905 0.257525 0.246509 0.225240 0.226268 0.248495 0.225084 0.243961 0.231387 0.319879 0.283026 0.240330 0.253579
chargesum: 0.00000
title: Mulliken charges with hydrogens summed into heavy atoms:
elementType: O O O O O O N N N C C C C C C C C C C C
charge: -0.164995 -0.153133 -0.174672 -0.161397 -0.178325 -0.179051 -0.029792 -0.015386 0.010056 0.138047 0.271545 0.010736 -0.020557 -0.018647 0.135371 0.285030 0.203396 0.285394 -0.261041 0.017419
polarizability: 2.14124013e+02 2.56503582e+00 1.90193048e+02 9.28751046e+00 1.96458606e+00 1.14230481e+02
1716.lowfreq: -13.2791 -10.1583 -0.0008 -0.0007 0.0006 5.5368 35.6426 46.9288 67.2988
frequency: 35.4260 46.8587 67.1523 80.8546 88.0099 108.7585 114.0905 132.0504 144.4760 157.2554 172.3836 183.9953 208.8643 229.4523 232.8701 246.2062 269.8419 297.0194 307.4109 319.0088 331.6158 354.8388 372.8814 403.9657 410.8531 442.8261 472.4192 512.0643 534.9026 577.9305 589.3330 631.9176 656.1833 683.0770 693.2797 719.4801 739.7174 746.7304 762.0256 786.6677 832.1623 863.0004 920.8147 927.7956 931.9539 951.6723 954.1486 1028.5207 1034.1639 1036.6427 1041.9784 1122.9908 1155.7225 1190.6116 1194.8132 1206.7051 1220.8238 1229.2082 1241.6336 1250.4345 1329.1096 1344.4236 1374.4240 1375.2520 1384.5281 1388.0439 1392.3813 1405.7573 1416.8540 1431.4924 1453.3971 1459.2602 1471.9181 1473.9837 1485.5566 1496.8510 1506.9427 1531.6615 1559.0832 1590.8877 2990.4629 2998.5739 3003.8145 3011.8982 3083.1497 3087.2704 3094.1359 3096.9385 3110.6451 3123.7963 3127.6392 3133.1357 3183.5815
redmass: 6.5381 8.9802 3.7454 7.3219 5.4972 7.9414 5.3454 1.3286 1.6308 5.5120 9.6706 4.3076 2.6941 1.3067 4.3445 1.9005 2.0674 8.7356 4.8244 4.3788 1.8840 3.7283 3.7737 2.9661 3.0856 4.2359 4.1403 6.4517 4.4091 3.4091 6.2928 6.9430 5.9943 10.6796 10.0374 7.8257 11.7582 7.3740 7.0359 4.6612 4.1457 9.0314 1.8875 1.7136 1.7586 3.5540 1.2258 1.3348 1.3937 1.5022 1.4460 5.8908 2.9642 2.7216 2.9775 11.4031 1.8122 8.7742 4.1739 11.9356 7.7217 7.7898 3.0005 3.0074 4.6695 1.5383 1.7547 1.3095 1.3229 2.6664 1.1375 1.0589 1.0661 1.0578 1.1052 1.0698 1.0489 1.0572 7.3224 8.4576 1.0354 1.0388 1.0387 1.0390 1.0997 1.0995 1.0981 1.0967 1.1007 1.0989 1.0995 1.0967 1.0928
irintensity: 0.3522 0.3146 0.3381 1.5306 3.5425 1.3238 0.3942 2.2493 0.5726 1.2848 6.6568 1.6248 1.1714 0.0930 0.4493 0.8565 0.5830 0.8538 0.6945 1.6348 0.4788 1.4629 2.6656 0.7525 1.1764 0.8132 2.0984 1.0028 1.5429 4.4116 0.9989 21.2743 4.8073 17.4063 33.9638 1.8740 3.1273 4.9660 4.8246 13.3905 1.3965 8.6661 1.2767 27.6531 7.9767 16.6174 0.4971 0.6218 0.3377 1.5193 3.7886 1.9975 17.7129 5.7478 51.7334 221.3265 52.5080 146.8918 38.3127 7.8696 31.3058 8.2323 4.5829 231.3097 68.1895 9.9075 50.6827 54.0262 28.2450 15.3641 19.4948 0.8213 13.3802 2.4844 18.2063 14.0847 4.8842 29.1001 11.0974 27.4924 22.1809 9.5018 27.3238 1.3163 3.1260 5.4502 58.3502 6.9762 3.8905 15.2343 4.9308 11.0238 15.1322
temp: 298.150 k
press: 1.00000 atm
elementType: 8 8 8 8 8 8 7 7 7 6 6 6 6 6 6 6 6 6 6 6 1 1 1 1 1 1 1 1 1 1 1 1 1
symmnumber: 1
zpe: 628741.3 jmol-1
zpe.correction: 0.239475 hartree
zpe.thermalcorrener: 0.259381 hartree
zpe.thermalcorrenthalpy: 0.260325 hartree
zpe.thermalcorrgfe: 0.191341 hartree
zpe.sumelectzpe: -1040.794848 hartree
zpe.sumelectthermal: -1040.774942 hartree
zpe.sumelectthermalent: -1040.773998 hartree
zpe.sumelectthermalfe: -1040.842982 hartree
dipole: 2.2180 -1.7406 -0.5867
dipole: 2.8798
quadrupole: -124.6225 -135.9512 -119.6921
quadrupole: 3.3910 -6.1106 -1.3075
quadrupole: 2.1328 -9.1960 7.0632 3.3910 -6.1106 -1.3075
hfenergy: -1041.0343227 hartree
pointgroup: C01 [X(C11H13N3O6)]
dipole: -0.8789105 0.7122546 -0.0625561 debye
polarizability: 211.970016|4.4093312|189.3091334|-16.9936758|7.9661467|117.2683933 unknown
InChI: InChI=1S/C11H13N3O6/c1-6-7(12(15)16)5-8(13(17)18)9(11(2,3)4)10(6)14(19)20/h5H,1-4H3
charge 0 multiplicity 1
33 atoms
O  -0.821478 2.613994 1.725559
O  -0.245353 3.347014 -0.35608
O  -1.722389 -2.822313 0.95309
O  -0.895722 -3.377427 -1.100329
O  4.145872 0.289315 -0.899415
O  3.799649 -1.866491 -0.242103
N  -0.385543 2.425742 0.528262
N  -1.042892 -2.568023 -0.111408
N  3.393343 -0.662224 -0.461979
C  -2.45372 0.231128 -0.015561
C  -0.906166 0.000962 0.02331
C  -3.026808 0.114824 1.433964
C  -3.162221 -0.80847 -0.946365
C  -2.837806 1.632032 -0.598773
C  0.059482 1.043203 0.178443
C  -0.293151 -1.279712 -0.151403
C  1.477143 0.926832 0.077121
C  1.952114 -0.37409 -0.228983
C  1.085171 -1.473299 -0.316841
C  2.386075 2.113867 0.326698
H  -4.118926 0.281429 1.396928
H  -2.838445 -0.885324 1.856551
H  -2.582005 0.874618 2.099049
H  -4.192968 -0.458192 -1.12562
H  -2.665275 -0.888472 -1.930435
H  -3.252271 -1.809436 -0.50251
H  -3.917859 1.614487 -0.823242
H  -2.688363 2.461002 0.108168
H  -2.306607 1.857153 -1.540486
H  1.490729 -2.471666 -0.499416
H  2.572965 2.662915 -0.612842
H  1.942222 2.818991 1.047536
H  3.366206 1.793231 0.707009
