program: Gaussian 09
title: 000019856
version: EM64L-G09RevD.01
frameworkgroup: C1[X(C10H12N6O)]
method: RPBEPBE
basis: SDD
operation: Freq
keyword: #p
keyword: freq=noraman
keyword: PBEPBE/SDD
title: #p freq=noraman PBEPBE/SDD
converged: NO YES NO NO
title: Mulliken charges:
elementType: O N N N N N N C C C C C C C C C C H H H H H H H H H H H H
charge: -0.310241 -0.380229 -0.032354 -0.114297 -0.628586 -0.017799 -0.084966 0.241470 0.272398 -0.315106 -0.332726 -0.240857 -0.244092 -0.215429 -0.681024 0.139751 -0.226410 0.251268 0.255115 0.217250 0.217243 0.233064 0.234110 0.362109 0.216340 0.235904 0.235941 0.351105 0.361046
chargesum: 0.00000
title: Mulliken charges with hydrogens summed into heavy atoms:
elementType: O N N N N N N C C C C C C C C C C
charge: -0.310241 -0.018120 -0.032354 -0.114297 0.083565 -0.017799 -0.084966 0.241470 0.272398 -0.063838 -0.077611 0.193636 -0.011027 0.018682 0.007161 0.139751 -0.226410
polarizability: 3.93366037e+02 4.05136466e+01 1.75631357e+02 2.44167735e-02 -9.40265709e-02 7.09080060e+01
1716.lowfreq: -6.1044 -4.0604 -0.0006 0.0004 0.0005 2.7968 34.7860 38.9029 45.4079
frequency: 34.7857 38.8802 45.3937 66.0149 94.2180 99.6716 116.1623 145.9563 187.5736 219.3826 232.4061 234.1470 253.2614 261.2354 315.2817 323.8039 391.5767 456.8817 466.2309 475.5559 515.1568 538.2620 551.2210 557.5251 590.5581 627.0133 645.6614 663.3062 687.7046 727.2240 750.3032 765.7888 816.9583 824.2473 830.5797 850.7811 902.2153 912.0770 929.0391 973.5959 1025.6900 1033.5157 1040.9124 1095.6161 1116.4334 1138.1102 1148.4211 1172.0724 1190.7823 1222.6940 1262.6832 1279.7558 1298.5239 1305.5680 1356.6087 1369.0440 1395.4818 1403.3122 1452.0907 1461.9244 1462.0545 1478.8787 1491.1381 1514.1847 1570.2327 1604.5690 1605.8814 1618.0259 2106.9756 2968.8038 3000.4969 3029.6915 3098.0649 3109.6412 3143.1604 3158.4022 3172.3980 3183.8766 3385.6766 3518.4704 3667.9379
redmass: 4.4967 6.5232 5.8424 3.5247 2.5864 6.1549 3.0590 4.8961 5.3399 4.9444 1.2662 6.1761 5.7813 5.8109 4.9313 3.8094 4.1693 3.2489 6.3259 6.0450 2.9428 6.9987 3.8048 1.4749 6.4726 1.1749 6.6886 4.9966 11.2002 3.9928 1.2426 4.3954 1.2457 1.1214 5.6630 1.3874 3.8678 3.8814 1.3710 1.3127 3.0317 2.6558 2.0865 2.6411 2.1808 1.4403 2.7600 1.0972 1.9904 4.7565 1.1370 2.7237 1.7027 5.0382 3.6267 1.4306 3.8945 1.4646 2.5654 1.9625 1.0400 1.0769 1.1195 2.7522 1.7170 6.2601 6.2699 2.7081 12.5689 1.0556 1.0364 1.1082 1.0988 1.1018 1.0859 1.0905 1.0951 1.0986 1.0748 1.0435 1.1057
irintensity: 8.2932 0.6959 1.5017 0.4900 3.2698 2.7246 0.3883 0.3236 0.0382 14.3920 0.4951 0.1806 0.3763 6.6805 4.6533 9.5359 2.2579 8.1021 15.4696 0.6851 2.8805 4.8327 0.4311 92.7882 8.8291 161.3292 15.8652 4.5055 30.8519 1.1477 108.4438 4.8834 87.5676 17.5998 0.8005 0.6445 41.1399 8.4411 4.0115 0.2049 25.3651 85.4833 1.9640 58.0757 15.9536 5.0740 0.1722 27.0546 15.9411 341.3502 0.0183 79.2464 0.8873 357.1001 718.3158 11.9963 0.5314 32.5478 54.1369 60.8142 13.6933 2.3117 15.9105 229.1119 185.1889 24.1812 56.6889 233.2268 161.2132 48.9611 16.3292 28.3211 27.3951 30.8658 0.0551 14.9483 21.5289 8.6449 89.3673 35.4662 59.0382
temp: 298.150 k
press: 1.00000 atm
elementType: 8 7 7 7 7 7 7 6 6 6 6 6 6 6 6 6 6 1 1 1 1 1 1 1 1 1 1 1 1
symmnumber: 1
zpe: 578845.7 jmol-1
zpe.correction: 0.220471 hartree
zpe.thermalcorrener: 0.237059 hartree
zpe.thermalcorrenthalpy: 0.238004 hartree
zpe.thermalcorrgfe: 0.174616 hartree
zpe.sumelectzpe: -790.686318 hartree
zpe.sumelectthermal: -790.669729 hartree
zpe.sumelectthermalent: -790.668785 hartree
zpe.sumelectthermalfe: -790.732173 hartree
dipole: -11.4959 -3.0137 0.0131
dipole: 11.8843
quadrupole: -135.0581 -86.3637 -102.6159
quadrupole: -23.7689 -0.0048 -0.0049
quadrupole: -27.0455 21.6489 5.3967 -23.7689 -0.0048 -0.0049
hfenergy: -790.9067885 hartree
pointgroup: C01 [X(C10H12N6O1)]
dipole: -4.595859 0.8556488 0.0879489 debye
polarizability: 397.8915344|-24.4639076|170.8620238|-7.5693362|-2.0302341|71.1518417 unknown
InChI: InChI=1S/C10H12N6O/c1-2-17-9-6-4-3-5-8(9)14-16-15-10(12)13-7-11/h3-6,14H,2,12H2,1H3
charge 0 multiplicity 1
29 atoms
O  -2.391968 -1.517021 0.204089
N  -0.167964 -0.11639 0.112373
N  1.046481 0.462139 0.064545
N  2.012093 -0.44714 0.065547
N  3.429763 1.515771 -0.025559
N  4.31623 -0.719489 0.014853
N  6.77443 -0.081587 -0.066852
C  -2.577996 -0.127516 0.172137
C  -1.364874 0.627066 0.122358
C  -3.82215 0.536464 0.184695
C  -1.412488 2.038744 0.085735
C  -3.589458 -2.386903 0.25143
C  -3.859506 1.950143 0.147688
C  -2.660468 2.696942 0.098507
C  -3.092135 -3.828519 0.273175
C  3.302657 0.147174 0.01665
C  5.589436 -0.31937 -0.029648
H  -4.755705 -0.031604 0.222876
H  -0.477047 2.602454 0.047777
H  -4.173233 -2.143264 1.161675
H  -4.214012 -2.184794 -0.641734
H  -4.826663 2.462949 0.157514
H  -2.695384 3.790458 0.070138
H  -0.22717 -1.148276 0.141964
H  -3.952797 -4.520539 0.306661
H  -2.500479 -4.053568 -0.630259
H  -2.462549 -4.014235 1.159747
H  2.583724 2.083935 -0.020321
H  4.351932 1.947077 -0.061361
