program: Gaussian 09
title: 000240080
version: EM64L-G09RevD.01
frameworkgroup: C1[X(C7H9NO2)]
method: RPBEPBE
basis: SDD
operation: Freq
keyword: #pfreq=noraman
keyword: PBEPBE/SDD
title: #p freq=noraman PBEPBE/SDD
converged: YES YES NO YES
title: Mulliken charges:
elementType: O O N C C C C C C C H H H H H H H H H
charge: -0.210744 -0.210743 -0.344739 -0.205438 -0.205443 -0.511031 -0.464972 -0.464976 0.130219 0.130227 0.268188 0.268192 0.258864 0.235752 0.244062 0.245541 0.245546 0.244055 0.347438
chargesum: 0.00000
title: Mulliken charges with hydrogens summed into heavy atoms:
elementType: O O N C C C C C C C
charge: -0.210744 -0.210743 0.002699 0.062751 0.062749 -0.016415 0.024631 0.024625 0.130219 0.130227
polarizability: 9.68480568e+01 -5.30569143e-05 8.20119838e+01 -2.92780643e-04 1.41012742e+00 6.26727930e+01
1716.lowfreq: -26.2166 -18.3390 -8.5173 -0.0007 -0.0004 0.0004 77.4362 141.0449 196.7318
frequency: 76.9251 141.0436 196.7173 247.2991 347.5778 384.2242 401.4751 499.7796 537.9826 651.5750 666.1523 694.2172 765.2741 786.6868 810.4642 829.1091 868.7393 884.6490 921.1813 934.1536 982.8629 996.5707 1051.7976 1058.0114 1106.9531 1139.7692 1162.1554 1190.2181 1207.3090 1268.6267 1283.4936 1293.4150 1302.6844 1307.7601 1314.7134 1322.9031 1364.0182 1467.8419 1473.1826 1488.7247 1643.2405 1646.2055 3012.6544 3015.8372 3025.7175 3068.9397 3081.0095 3086.9140 3089.8300 3095.1280 3487.3221
redmass: 3.0504 9.4754 2.2609 3.4358 5.0439 2.6221 6.7073 4.4225 7.0414 6.8001 3.9866 2.1493 5.4267 1.3399 1.8122 2.7217 3.2789 2.6196 2.3309 2.4910 1.7828 2.2665 1.5859 2.3651 1.3044 1.2457 1.9199 1.3469 1.3884 1.6377 1.3399 1.4894 1.4306 1.5872 4.8807 1.6284 1.8032 1.0760 1.0843 1.0963 5.5631 11.1575 1.0600 1.0604 1.0630 1.1035 1.1052 1.0874 1.0955 1.0995 1.0764
irintensity: 0.0724 7.5749 0.1748 0.1800 15.4513 7.9900 3.7945 18.1522 6.6887 2.7245 2.3564 11.6632 1.9470 26.5126 84.2010 4.9413 2.8262 2.2283 1.7071 3.8366 2.8340 8.2824 29.6872 0.2385 98.3300 27.8295 10.5577 2.3316 21.9143 98.9292 0.1523 0.2902 10.0418 9.9520 53.2546 34.6868 5.6340 9.8760 17.4375 6.9688 497.3260 114.7410 19.1793 32.2134 37.2845 1.8654 16.4230 19.9758 3.3516 38.0139 32.4914
temp: 298.150 k
press: 1.00000 atm
elementType: 8 8 7 6 6 6 6 6 6 6 1 1 1 1 1 1 1 1 1
symmnumber: 1
zpe: 404822.5 jmol-1
zpe.correction: 0.154189 hartree
zpe.thermalcorrener: 0.162187 hartree
zpe.thermalcorrenthalpy: 0.163131 hartree
zpe.thermalcorrgfe: 0.121245 hartree
zpe.sumelectzpe: -476.623516 hartree
zpe.sumelectthermal: -476.615518 hartree
zpe.sumelectthermalent: -476.614574 hartree
zpe.sumelectthermalfe: -476.656461 hartree
dipole: 0.0001 3.7593 0.6857
dipole: 3.8213
quadrupole: -74.8769 -56.8944 -55.8635
quadrupole: 0.0005 0.0005 0.1512
quadrupole: -12.3320 5.6505 6.6814 0.0005 0.0005 0.1512
hfenergy: -476.7777052 hartree
pointgroup: C01 [X(C7H9N1O2)]
dipole: -0.0008816 1.4772609 -0.2792516 debye
dipolederiv: -1.0702773 -0.1772354 0.0115789 -0.3518552 -0.6497213 0.06014 0.0927843 0.0961873 -0.3404994 -1.0709078 0.1765494 -0.0124014 0.3512532 -0.6490019 0.0604764 -0.093492 0.0961674 -0.3405858 -1.5948146 -0.0008149 -0.0005973 -0.0008348 -0.4247768 0.0140669 -0.0007175 0.0469759 -0.3121077 0.0337106 -0.121628 0.0181043 -0.0679746 -0.2284307 0.0366014 0.0199005 -0.0384116 0.0451325 0.0334707 0.1220459 -0.0181721 0.0683048 -0.2281471 0.0366397 -0.0198499 -0.0382614 0.0450837 0.0066776 -0.0000738 -0.0000076 -0.000038 0.0767099 -0.0184432 -0.0000285 0.0095484 0.0598396 0.0335637 0.0302955 -0.0028509 -0.0123855 0.0775239 -0.0334303 -0.0079414 0.0506959 0.0529586 0.0335672 -0.0303972 0.0028922 0.0123661 0.0774947 -0.0334305 0.007863 0.0506485 0.0529609 1.7203357 0.0815436 0.017271 -0.0590951 0.9607642 -0.150268 0.0387419 -0.2110468 0.1735725 1.7204253 -0.0802992 -0.01556 0.0602548 0.9607609 -0.1502259 -0.0370467 -0.2111282 0.1735083 -0.0821415 0.0262245 -0.06068 0.0129694 0.0557442 0.0128758 -0.0437806 0.0208526 0.0571633 -0.0821874 -0.0264375 0.0605143 -0.0131711 0.055684 0.0129405 0.043615 0.0208882 0.0572656 0.0555149 0.0000748 0.0001703 0.0001012 0.0160636 -0.1411083 0.0001265 -0.0870499 -0.0717296 0.0645344 0.0001137 -0.0000842 0.0000754 -0.1355911 0.1205529 -0.000045 0.0704156 0.0543867 0.0201913 -0.0105803 0.0595135 -0.0463526 0.069774 0.0669168 0.073573 0.0303222 -0.0844998 0.0196172 0.0462255 -0.0012947 0.0888074 -0.1389172 -0.0040274 -0.0238526 0.00919 0.0765793 0.0197755 -0.0460243 0.0012359 -0.0885842 -0.1391061 -0.0041288 0.0237736 0.0091709 0.0766114 0.0202475 0.0104807 -0.0595014 0.0462164 0.0698465 0.0668965 -0.0735105 0.0302434 -0.0846383 0.1186972 -0.000063 -0.0001306 -0.0000576 0.1733264 0.0469555 -0.0001132 0.0445915 0.3089982 unknown
polarizability: 96.8480422|0.0104811|81.9931253|0.0167454|-1.5339232|62.6916661 unknown
InChI: InChI=1S/C7H9NO2/c9-6-4-1-2-5(3-4)7(10)8-6/h4-5,8H,1-3H2
charge 0 multiplicity 1
19 atoms
O  -2.325094 -1.399262 0.195508
O  2.326621 -1.396088 0.197623
N  0.000749 -1.367438 0.182923
C  -1.193448 0.716917 -0.413122
C  1.192651 0.718604 -0.41188
C  -0.000048 0.924773 -1.381936
C  -0.784992 1.593348 0.82404
C  0.781691 1.594444 0.824854
C  -1.263471 -0.752549 -0.000474
C  1.264299 -0.750761 0.00086
H  -2.176286 0.995164 -0.823034
H  2.175513 0.998214 -0.820807
H  0.000903 0.228166 -2.238188
H  -0.00058 1.957899 -1.774033
H  -1.2114 1.20157 1.762953
H  -1.180467 2.61489 0.685577
H  1.175902 2.616536 0.686851
H  1.207666 1.203218 1.764196
H  0.001291 -2.353447 0.472089
