program: Gaussian 09
title: 000240102
version: EM64L-G09RevD.01
frameworkgroup: C1[X(C18H16ClN3O)]
method: RPBEPBE
basis: SDD
operation: Freq
keyword: #p
keyword: freq=noraman
keyword: PBEPBE/SDD
title: #p freq=noraman PBEPBE/SDD
converged: YES YES NO NO
title: Mulliken charges:
elementType: Cl O N N N C C C C C C C C C C C C C C C C C C H H H H H H H H H H H H H H H H
charge: -0.053137 -0.256069 -0.159977 -0.042334 -0.025445 0.215321 0.000760 0.062115 0.111207 -0.639686 0.316463 -0.321778 -0.337191 -0.147531 -0.219226 -0.367580 -0.382171 -0.653956 0.220267 -0.233313 -0.229800 -0.236724 -0.723128 0.258730 0.267472 0.294586 0.257392 0.261002 0.258319 0.266942 0.236053 0.270348 0.286681 0.231607 0.229821 0.232357 0.240161 0.245315 0.266126
chargesum: 0.00000
title: Mulliken charges with hydrogens summed into heavy atoms:
elementType: Cl O N N N C C C C C C C C C C C C C C C C C C
charge: -0.053137 -0.256069 -0.159977 -0.042334 -0.025445 0.215321 0.000760 0.062115 0.111207 -0.113484 0.316463 -0.027192 -0.079799 -0.147531 0.041776 -0.109261 -0.115229 0.139127 0.220267 -0.001705 0.000021 -0.004368 0.028474
polarizability: 3.30670475e+02 -8.38381525e+00 2.64644998e+02 1.13352365e+01 -1.79933947e+01 1.49057562e+02
1716.lowfreq: -6.3883 -2.0413 0.0021 0.0022 0.0022 8.8525 27.6683 42.6427 46.2011
frequency: 27.6545 42.6364 46.1944 58.7520 74.5667 80.7397 83.0959 151.2825 157.8071 182.3342 199.0096 206.8911 212.7054 226.0768 270.7740 271.2353 310.1550 325.3444 344.2412 393.7523 395.9626 407.0264 409.0622 425.5715 448.1336 468.8938 481.7939 508.4160 533.8611 561.0929 584.4413 602.8509 615.6642 631.1937 656.9108 667.4113 690.1352 701.7282 724.7471 736.8115 777.2783 788.6094 821.8363 830.5276 858.8058 900.7347 913.1602 928.6924 938.7687 961.4516 971.8291 978.3149 986.6739 989.8470 1002.2545 1018.1150 1029.0158 1041.5929 1082.0708 1084.7994 1092.5869 1116.4201 1130.7635 1134.3474 1159.8957 1173.4155 1189.2302 1205.4139 1212.7158 1251.7847 1269.5836 1290.0688 1315.8780 1324.7686 1344.8530 1367.3765 1381.4007 1388.8833 1389.5507 1428.3243 1433.5251 1434.9835 1449.1645 1450.3752 1467.4688 1481.2180 1490.7372 1502.5639 1517.6583 1551.5527 1583.3312 1588.6009 1603.4422 1605.3961 1609.7731 2945.1075 2997.6418 3012.8911 3095.1849 3105.9196 3106.3438 3128.1703 3130.7749 3132.1533 3137.3923 3149.7209 3155.9492 3160.3456 3166.3834 3170.4360 3177.4241
redmass: 4.4121 5.8284 4.5446 4.8383 5.2968 5.6724 5.1838 4.9491 4.2681 7.4869 1.2052 1.4190 2.0306 5.5224 5.7956 5.4920 5.3758 4.9587 5.9092 5.1563 5.0021 3.0867 3.4224 3.4573 5.0864 4.4269 4.1547 3.9400 3.8771 4.6885 3.1566 4.1865 6.3988 6.4502 5.6696 6.0220 5.5346 1.8364 4.7759 3.3194 3.9631 2.4979 4.9884 1.6434 1.2497 1.5135 3.5193 3.5984 1.5474 1.3411 2.0782 5.9349 1.3963 6.1240 1.3316 1.9327 2.0529 1.6771 2.1965 1.6078 2.8938 1.8397 1.5053 1.9734 1.9397 1.0621 1.1283 1.3105 3.8231 1.5569 3.0076 3.8757 1.3599 1.2964 3.3253 9.1834 7.8578 3.1966 1.2770 1.2149 1.4640 1.5676 2.4189 1.0715 1.0925 2.3553 1.0932 1.0640 5.9882 7.9462 7.3759 6.8673 8.2220 6.8224 6.1598 1.0698 1.0363 1.0354 1.0997 1.0963 1.0922 1.0849 1.1015 1.1029 1.0883 1.0931 1.0883 1.0960 1.0922 1.1005 1.0977
irintensity: 0.5223 1.6553 0.0604 0.3766 0.6907 4.1562 2.5968 2.6821 1.6029 0.5349 0.2024 1.4672 1.5685 5.9227 3.7639 0.5400 3.8568 5.1757 4.5866 8.8561 0.6210 0.5892 2.7175 1.0529 4.8201 6.1943 11.6386 5.4687 14.3517 9.8767 5.0239 16.2569 0.2773 17.4042 18.7408 3.8308 2.1274 50.9607 23.1009 15.5213 17.2221 29.5416 10.4703 37.5544 3.7089 13.9221 26.4388 27.9498 4.6828 0.4746 61.8100 9.5942 3.9639 1.1763 0.7373 20.6241 14.0190 7.6275 22.4795 14.3782 5.7260 44.6494 17.0137 148.0018 26.2383 0.5809 11.2335 27.9769 14.7264 42.5252 432.4341 60.1951 8.2641 17.4751 304.3513 20.7179 0.5172 23.1679 26.1257 104.1802 2.8328 33.4662 49.6102 20.6571 56.3656 2.6680 12.5470 31.9088 38.8606 32.4390 152.4262 84.8012 445.0794 15.0929 8.3701 33.9625 36.5163 4.9076 12.4013 5.0961 26.3952 0.7879 1.5846 23.3138 5.6840 25.5488 2.3970 18.1094 0.6071 19.8153 5.1458
temp: 298.150 k
press: 1.00000 atm
elementType: 17 8 7 7 7 6 6 6 6 6 6 6 6 6 6 6 6 6 6 6 6 6 6 1 1 1 1 1 1 1 1 1 1 1 1 1 1 1 1
symmnumber: 1
zpe: 786725.5 jmol-1
zpe.correction: 0.299648 hartree
zpe.thermalcorrener: 0.319812 hartree
zpe.thermalcorrenthalpy: 0.320756 hartree
zpe.thermalcorrgfe: 0.249846 hartree
zpe.sumelectzpe: -1393.428349 hartree
zpe.sumelectthermal: -1393.408186 hartree
zpe.sumelectthermalent: -1393.407241 hartree
zpe.sumelectthermalfe: -1393.478151 hartree
dipole: 1.5150 -0.2161 -1.3148
dipole: 2.0176
quadrupole: -161.0238 -130.5484 -137.2836
quadrupole: 14.5307 12.9949 -4.1759
quadrupole: -18.0719 12.4035 5.6684 14.5307 12.9949 -4.1759
hfenergy: -1393.7279974 hartree
pointgroup: C01 [X(C18H16Cl1N3O1)]
dipole: 0.5510103 -0.2204733 -0.5271271 debye
polarizability: 322.5027315|-23.6824162|273.7521412|4.4171329|-17.2510659|148.1181617 unknown
InChI: InChI=1S/C18H16ClN3O/c1-12(23)22(2)17-11-20-18(13-6-4-3-5-7-13)15-10-14(19)8-9-16(15)21-17/h3-10H,11H2,1-2H3
charge 0 multiplicity 1
39 atoms
Cl 3.065686 -4.290733 -0.434346
O  -5.187018 1.657344 0.952067
N  -3.236578 1.095587 -0.181604
N  -0.054774 1.287852 -1.173355
N  -1.829567 -0.788807 0.22263
C  0.626993 -0.96246 -0.336494
C  0.81664 0.507472 -0.547881
C  -0.659565 -1.535391 -0.017049
C  -2.144797 0.26234 -0.501294
C  -1.274587 0.634425 -1.705741
C  2.059864 1.170706 -0.039314
C  1.757359 -1.827065 -0.434138
C  -0.751559 -2.942748 0.204041
C  1.610313 -3.206192 -0.254227
C  0.361745 -3.784922 0.071045
C  2.723931 0.709215 1.129751
C  2.560638 2.322889 -0.704352
C  -3.234833 2.484728 -0.723382
C  -4.335077 0.763615 0.684481
C  3.864474 1.382686 1.618482
C  3.703961 2.989332 -0.219687
C  4.361518 2.521329 0.943857
C  -4.480811 -0.649011 1.215286
H  -1.046275 -0.313622 -2.240138
H  -1.775256 1.322074 -2.40056
H  2.73741 -1.404999 -0.672936
H  -1.727051 -3.350956 0.484486
H  0.27226 -4.864124 0.22448
H  2.335654 -0.160871 1.669604
H  2.033562 2.678829 -1.594861
H  -3.680169 2.525425 -1.733503
H  -2.2057 2.87597 -0.744994
H  -3.856075 3.09553 -0.052528
H  4.360832 1.022316 2.52611
H  4.085194 3.871157 -0.746428
H  5.250249 3.039997 1.32038
H  -4.341227 -1.4054 0.425732
H  -5.48724 -0.728269 1.654097
H  -3.716822 -0.860247 1.980885
