program: Gaussian 09
title: 000240059
version: EM64L-G09RevD.01
frameworkgroup: C1[X(C12H11ClN2O2)]
method: RPBEPBE
basis: SDD
operation: Freq
keyword: #p
keyword: freq=noraman
keyword: PBEPBE/SDD
title: #p freq=noraman PBEPBE/SDD
converged: YES YES NO NO
title: Mulliken charges:
elementType: Cl O O N N C C C C C C C C C C C C H H H H H H H H H H H
charge: -0.069540 -0.223168 -0.296631 -0.415855 -0.493076 -0.457531 0.352549 0.492378 0.302421 -0.413755 -0.439353 -0.324294 -0.253258 -0.187446 -0.200026 -0.169738 -0.118655 0.278282 0.238958 0.290547 0.289726 0.261027 0.220468 0.313976 0.254789 0.252932 0.253113 0.261158
chargesum: 0.00000
title: Mulliken charges with hydrogens summed into heavy atoms:
elementType: Cl O O N N C C C C C C C C C C C C
charge: -0.069540 -0.223168 -0.296631 -0.125308 -0.203350 0.059709 0.352549 0.492378 0.302421 -0.152727 -0.218885 -0.010318 0.001531 0.065486 0.053087 0.091420 -0.118655
polarizability: 2.70363736e+02 -4.23778078e+00 1.22961654e+02 -1.71558361e+01 8.87777027e+00 1.02387964e+02
1716.lowfreq: -9.2893 -2.2292 -0.0007 0.0012 0.0018 0.3340 14.7886 29.9513 39.1095
frequency: 14.6995 29.8726 39.0262 49.1405 70.4676 104.2653 131.9516 172.7011 216.0733 223.2994 279.5116 308.9419 311.4557 345.5378 373.4633 401.3892 411.1982 475.3833 506.5074 583.2677 594.1517 613.1124 623.6573 662.8286 689.4184 699.4454 706.3477 733.2521 762.1541 808.6990 821.4676 831.2346 844.5576 866.7886 875.7839 879.5399 931.4253 934.4779 979.1985 991.6143 997.3970 1022.7862 1047.9599 1072.8476 1092.9177 1115.0949 1133.8888 1183.2927 1185.2533 1207.0994 1222.7642 1255.5352 1268.6658 1294.1937 1340.3838 1363.8609 1368.4405 1401.1987 1466.8379 1473.4093 1484.2304 1489.1548 1508.0038 1589.1741 1594.2849 1608.8483 1642.6617 2988.1614 3050.0618 3116.5937 3164.9484 3172.7382 3194.9839 3217.8168 3233.4636 3268.9594 3527.3342 3552.5963
redmass: 6.1609 4.8186 4.9442 7.3018 6.9431 6.0691 6.0783 3.2606 7.4352 7.2396 4.9858 3.0446 3.0957 4.3732 2.5825 3.1312 3.0159 4.6932 2.6311 1.2271 3.1786 5.3103 6.1332 5.4981 6.2250 3.9254 7.6516 1.2706 4.4390 1.4110 1.3802 4.4478 1.4041 4.7362 3.0688 1.6155 1.3556 2.7121 1.3120 4.3195 2.7440 1.6354 3.2336 2.7820 4.1835 1.3586 1.5543 1.1115 1.7397 1.8613 2.0213 1.4480 2.1354 1.3908 1.4804 3.8962 2.3027 4.5662 1.1103 1.8060 2.4812 4.1275 2.4479 6.7575 6.2920 6.0992 4.2716 1.0623 1.0987 1.0901 1.0910 1.0949 1.0953 1.0933 1.0978 1.1084 1.0762 1.0776
irintensity: 0.2313 0.4529 0.3677 0.9502 11.4876 1.9605 0.4918 1.1347 4.9560 0.2809 18.8469 4.2948 5.4893 9.1613 22.9130 18.7635 0.0883 5.5943 68.0648 146.7324 5.7958 2.7748 3.4963 21.5648 15.1302 7.1009 9.4679 87.3758 10.9516 42.5337 29.0320 3.3767 59.8932 11.9187 5.3862 3.3949 0.9020 4.8458 3.3024 31.1687 7.7168 36.4331 0.2386 34.2986 13.0411 16.1717 18.7028 6.3959 23.8930 353.0595 36.5668 80.4137 16.8535 27.1499 1.2235 131.5673 12.3615 8.8422 62.7383 332.0026 1.7204 7.9378 885.0507 6.3256 33.4072 28.0819 167.2534 54.0857 7.6334 18.5327 3.0856 3.1399 10.3279 4.6187 0.3749 0.4223 5.4680 28.1684
temp: 298.150 k
press: 1.00000 atm
elementType: 17 8 8 7 7 6 6 6 6 6 6 6 6 6 6 6 6 1 1 1 1 1 1 1 1 1 1 1
symmnumber: 1
zpe: 549176.6 jmol-1
zpe.correction: 0.209170 hartree
zpe.thermalcorrener: 0.224685 hartree
zpe.thermalcorrenthalpy: 0.225630 hartree
zpe.thermalcorrgfe: 0.162786 hartree
zpe.sumelectzpe: -1182.666367 hartree
zpe.sumelectthermal: -1182.650852 hartree
zpe.sumelectthermalent: -1182.649907 hartree
zpe.sumelectthermalfe: -1182.712751 hartree
dipole: 5.0464 -3.5040 -2.8726
dipole: 6.7820
quadrupole: -104.4448 -102.2733 -102.2967
quadrupole: -3.3708 -2.8936 2.2770
quadrupole: -1.4398 0.7316 0.7082 -3.3708 -2.8936 2.2770
hfenergy: -1182.8755371 hartree
pointgroup: C01 [X(C12H11Cl1N2O2)]
dipole: -1.8705957 1.2633592 1.4228164 debye
polarizability: 268.4754885|-20.8849699|104.5503372|-11.919248|11.4676601|122.6875285 unknown
InChI: InChI=1S/C12H11ClN2O2/c13-9-3-5-10(6-4-9)15-12(16)14-8-11-2-1-7-17-11/h1-7,14-15H,8H2
charge 0 multiplicity 1
28 atoms
Cl 6.71015 -0.64661 -0.272496
O  -3.714946 -1.020442 0.611082
O  -0.152049 -0.237865 -1.67974
N  -1.469446 0.944004 -0.156161
N  0.820924 0.692702 0.265589
C  -2.715169 0.68746 -0.900067
C  -3.842607 0.237987 -0.022185
C  2.187527 0.349314 0.086528
C  -0.254512 0.417848 -0.599105
C  -5.068689 0.793066 0.313745
C  3.099625 0.750776 1.101415
C  2.672526 -0.364787 -1.043246
C  -5.744933 -0.144212 1.188939
C  4.472837 0.451123 0.998811
C  4.04801 -0.66306 -1.146051
C  -4.89573 -1.22501 1.347162
C  4.931016 -0.25454 -0.129736
H  -2.458947 -0.074215 -1.6596
H  -3.045767 1.59523 -1.441313
H  -1.534548 1.483342 0.708099
H  0.610025 1.187997 1.134394
H  -5.447227 1.755241 -0.02687
H  2.739424 1.301993 1.979513
H  1.971973 -0.677924 -1.819007
H  -6.729684 -0.028261 1.636774
H  5.169147 0.762319 1.782466
H  4.422376 -1.212404 -2.014766
H  -4.950106 -2.159874 1.897624
