program: Gaussian 09
title: 000240060
version: EM64L-G09RevD.01
frameworkgroup: C1[X(C12H10Cl2N2O2)]
method: RPBEPBE
basis: SDD
operation: Freq
keyword: #p
keyword: freq=noraman
keyword: PBEPBE/SDD
title: #p freq=noraman PBEPBE/SDD
converged: YES YES NO NO
title: Mulliken charges:
elementType: Cl Cl O O N N C C C C C C C C C C C C H H H H H H H H H H
charge: -0.069065 -0.052887 -0.223299 -0.292977 -0.409332 -0.488534 -0.458183 0.353332 0.636160 0.303940 -0.412988 -0.397431 -0.257698 -0.252510 -0.101763 -0.199990 -0.262682 -0.168799 0.278585 0.241158 0.297714 0.298947 0.261269 0.339546 0.258321 0.255225 0.262387 0.261554
chargesum: 0.00000
title: Mulliken charges with hydrogens summed into heavy atoms:
elementType: Cl Cl O O N N C C C C C C C C C C C C
charge: -0.069065 -0.052887 -0.223299 -0.292977 -0.111618 -0.189587 0.061560 0.353332 0.636160 0.303940 -0.151719 -0.397431 0.081849 0.002715 -0.101763 0.058330 -0.000295 0.092755
polarizability: 2.52486723e+02 -2.11685666e+01 1.67138840e+02 1.40287988e+01 1.65807343e+00 1.02137396e+02
1716.lowfreq: -3.1925 0.0010 0.0019 0.0031 3.2507 8.2044 14.1730 28.7020 37.2461
frequency: 14.0735 28.6992 37.2302 58.3115 79.9115 91.4805 99.3772 172.0813 175.5604 206.4147 219.5287 270.9752 288.2747 300.8943 307.9159 324.1037 398.2841 420.7884 439.5301 456.4654 509.3182 574.2294 590.3627 595.6532 635.9566 639.8142 683.9964 705.2765 709.0676 712.4458 735.3668 764.7800 789.1041 822.0496 866.9696 876.1871 879.6098 887.1852 916.4703 929.9968 937.6089 997.6721 1005.7334 1024.5836 1048.4271 1077.1894 1095.6423 1133.2233 1134.5446 1187.3394 1212.5962 1223.5397 1241.0826 1257.9645 1269.8714 1343.6753 1366.6501 1370.3280 1413.5265 1442.4137 1470.2249 1484.2457 1490.1389 1511.1627 1570.9106 1589.7255 1608.2825 1647.5438 2992.4378 3053.3954 3166.2412 3186.8911 3188.0198 3218.0458 3233.6855 3269.4436 3485.5987 3550.4060
redmass: 6.6003 6.2814 5.1996 7.3601 5.8054 8.3289 9.1320 9.7471 4.5647 7.3527 4.2161 6.5297 4.3829 6.0700 17.4128 3.6748 2.1370 3.6249 3.5195 2.3609 8.5689 3.7243 5.2083 3.3396 4.7090 1.3087 5.7271 6.9633 6.1281 5.8673 1.2654 4.4150 1.3248 1.3040 5.1800 2.7652 1.7263 5.6646 1.3515 1.3487 2.7163 3.0243 5.1330 1.6838 3.2626 1.8773 4.8652 1.4041 1.5171 1.7823 1.8261 2.0951 1.6460 1.3986 1.8144 1.4855 2.7215 3.5291 4.1168 2.5510 1.0799 2.2972 3.3123 2.8150 4.8906 6.7645 8.0212 4.2046 1.0620 1.0992 1.0893 1.0940 1.0968 1.0933 1.0979 1.1084 1.0760 1.0779
irintensity: 0.3248 0.0662 0.5916 6.4562 2.7477 0.6085 4.5610 1.6721 0.7195 5.4487 1.0438 2.0290 17.4674 0.7169 0.3231 11.5414 23.3992 5.8829 6.5573 49.4669 34.3272 4.1461 3.1237 7.2582 6.8328 142.6567 4.0775 4.6257 2.0979 27.8447 87.9653 11.1938 47.7542 30.2933 13.8801 4.8380 8.3367 60.5618 25.7578 10.6702 0.6605 7.9536 75.6017 34.6195 0.0914 24.5213 5.4703 9.1547 11.3014 30.7532 342.5296 31.1293 16.4839 71.3434 34.5483 2.4644 53.9884 78.6086 80.6208 76.0724 26.0379 257.2236 118.4231 686.5486 53.8341 7.0437 160.9800 195.8895 48.6321 6.7803 0.5616 14.3377 14.4584 4.4098 0.3288 0.3664 39.3034 30.4507
temp: 298.150 k
press: 1.00000 atm
elementType: 17 17 8 8 7 7 6 6 6 6 6 6 6 6 6 6 6 6 1 1 1 1 1 1 1 1 1 1
symmnumber: 1
zpe: 524644.7 jmol-1
zpe.correction: 0.199827 hartree
zpe.thermalcorrener: 0.216490 hartree
zpe.thermalcorrenthalpy: 0.217434 hartree
zpe.thermalcorrgfe: 0.151780 hartree
zpe.sumelectzpe: -1642.057469 hartree
zpe.sumelectthermal: -1642.040806 hartree
zpe.sumelectthermalent: -1642.039862 hartree
zpe.sumelectthermalfe: -1642.105516 hartree
dipole: -3.5566 4.0035 -0.7745
dipole: 5.4109
quadrupole: -95.5006 -125.2316 -115.1062
quadrupole: 2.4077 3.8936 -0.2710
quadrupole: 16.4455 -13.2854 -3.1601 2.4077 3.8936 -0.2710
hfenergy: -1642.2572959 hartree
pointgroup: C01 [X(C12H10Cl2N2O2)]
dipole: 1.2002813 -1.6235822 0.674613 debye
polarizability: 246.352465|-32.979597|152.9712009|5.4828429|-32.3711092|122.4392929 unknown
InChI: InChI=1S/C12H10Cl2N2O2/c13-8-3-4-10(14)11(6-8)16-12(17)15-7-9-2-1-5-18-9/h1-6,15-16H,7H2
charge 0 multiplicity 1
28 atoms
Cl -2.506121 -2.579664 1.558762
Cl -4.593049 2.723146 -1.40699
O  3.738426 0.62087 0.967402
O  0.156273 1.041147 -1.361613
N  1.468518 -0.732834 -0.595739
N  -0.805695 -0.683587 -0.055692
C  2.714238 -0.177046 -1.155164
C  3.852423 -0.19605 -0.181619
C  -2.151686 -0.272086 -0.01708
C  0.264177 -0.044954 -0.71732
C  5.075791 -0.849224 -0.155949
C  -3.092784 -1.059735 0.706353
C  -2.635833 0.899269 -0.665873
C  5.764812 -0.432651 1.049629
C  -3.998777 1.218848 -0.566345
C  -4.450922 -0.724343 0.797038
C  -4.926939 0.438722 0.149789
C  4.924811 0.451398 1.703223
H  2.467411 0.85169 -1.476327
H  3.025273 -0.739372 -2.056646
H  1.530114 -1.608005 -0.073297
H  -0.609778 -1.539674 0.47231
H  5.444397 -1.542367 -0.910141
H  -1.930368 1.519327 -1.221749
H  -5.135226 -1.360203 1.36516
H  6.751015 -0.749612 1.382239
H  -5.981053 0.719543 0.206576
H  4.989352 1.01875 2.627262
