program: Gaussian 09
title: 000240056
version: EM64L-G09RevD.01
frameworkgroup: C1[X(C13H10O2S)]
method: RPBEPBE
basis: SDD
operation: Freq
keyword: #p
keyword: freq=noraman
keyword: PBEPBE/SDD
title: #p freq=noraman PBEPBE/SDD
converged: YES YES NO NO
title: Mulliken charges:
elementType: S O O C C C C C C C C C C C C C H H H H H H H H H H
charge: 0.260760 -0.470874 -0.263336 0.144009 0.224787 0.110501 -0.318644 -0.111043 -0.311928 -0.403463 -0.133179 -0.258795 -0.203082 -0.293037 -0.134672 -0.518530 0.287956 0.295525 0.278315 0.213125 0.234678 0.232245 0.257255 0.247846 0.269456 0.364128
chargesum: 0.00000
title: Mulliken charges with hydrogens summed into heavy atoms:
elementType: S O O C C C C C C C C C C C C C
charge: 0.260760 -0.106746 -0.263336 0.144009 0.224787 0.110501 -0.030688 -0.111043 -0.016403 -0.190338 0.145136 -0.024117 0.029162 -0.035782 0.113173 -0.249074
polarizability: 3.52393298e+02 1.44323074e+01 1.73438464e+02 -1.33238568e-01 1.52485469e-01 6.13899391e+01
1716.lowfreq: -2.5664 -0.0022 -0.0010 0.0014 4.3201 9.8757 14.3521 29.4311 54.3666
frequency: 14.3194 29.3828 54.3606 93.9270 113.2839 158.4327 174.6450 205.7753 250.4143 288.9984 294.1059 364.4370 379.3973 417.7903 432.9998 476.6158 524.4196 533.1095 537.2121 564.3393 568.9697 630.0192 669.7460 679.7971 703.6313 712.6177 752.4695 766.6957 805.0312 823.5481 831.4507 855.3009 874.8095 908.1208 915.9494 961.0186 1004.7724 1008.8656 1012.7523 1039.9082 1056.3961 1077.4074 1086.0871 1141.3930 1157.2539 1173.2271 1201.2519 1233.3342 1245.7313 1286.7845 1300.5504 1335.1798 1354.9019 1390.2102 1427.2394 1450.8059 1480.7667 1503.7228 1530.4362 1590.2672 1607.6862 1617.0004 3104.2201 3105.4704 3140.5137 3153.2235 3170.2360 3170.5547 3187.9212 3191.1965 3238.0805 3569.1723
redmass: 5.5414 7.0977 5.8262 6.0476 4.0057 3.4054 7.6512 7.0434 3.9260 3.4660 7.4277 7.1655 1.1468 6.2100 3.4875 4.4289 3.5392 4.9644 8.0110 9.0009 2.9683 6.8812 3.8165 6.4985 1.1846 7.6746 2.8953 1.4890 6.1520 4.7748 1.3262 1.4481 5.1517 2.0117 1.3775 1.3545 1.3263 1.1309 3.9732 2.0346 2.1292 1.8918 1.2990 1.7651 1.2505 1.0763 2.4081 2.2262 1.4431 1.4841 1.5226 1.9902 2.6455 6.2835 2.5830 6.3884 2.4930 8.3158 5.3607 6.4892 5.9476 5.7698 1.0893 1.0891 1.0878 1.0927 1.1000 1.0902 1.0964 1.0930 1.0996 1.0657
irintensity: 0.8491 0.9816 0.5143 0.0838 0.0280 0.0435 1.3320 0.3507 3.6516 2.2615 6.3122 4.3323 126.7676 6.2879 0.0056 10.6539 9.7855 14.1626 20.9148 15.4507 2.8137 17.1416 16.9857 0.2268 92.6840 32.1935 16.3147 85.0314 12.7817 18.6027 15.0992 0.6032 18.4925 13.9458 0.0663 1.2820 0.3829 50.5819 66.7322 8.0344 16.0584 57.1115 48.6964 7.9324 38.4832 11.0663 112.1079 34.6853 10.2973 70.6895 32.3325 393.5157 5.5626 16.1496 39.5023 84.3915 27.2945 256.4605 1.5234 54.4725 332.0200 81.9954 0.3135 13.4681 9.4145 2.9518 43.5335 3.4939 4.3951 22.2372 0.6524 32.2537
temp: 298.150 k
press: 1.00000 atm
elementType: 16 8 8 6 6 6 6 6 6 6 6 6 6 6 6 6 1 1 1 1 1 1 1 1 1 1
symmnumber: 1
zpe: 500706.9 jmol-1
zpe.correction: 0.190709 hartree
zpe.thermalcorrener: 0.204888 hartree
zpe.thermalcorrenthalpy: 0.205832 hartree
zpe.thermalcorrgfe: 0.147094 hartree
zpe.sumelectzpe: -1048.742839 hartree
zpe.sumelectthermal: -1048.728660 hartree
zpe.sumelectthermalent: -1048.727716 hartree
zpe.sumelectthermalfe: -1048.786455 hartree
dipole: -0.6604 5.3320 0.0018
dipole: 5.3727
quadrupole: -71.2443 -91.4361 -106.7709
quadrupole: -3.9228 0.0497 -0.0122
quadrupole: 18.5728 -1.6190 -16.9538 -3.9228 0.0497 -0.0122
hfenergy: -1048.9335484 hartree
pointgroup: C01 [X(C13H10O2S1)]
dipole: -0.3419991 -0.1815679 2.078035 debye
dipolederiv: 0.166505 -0.001759 0.0481277 -0.0093256 0.1358275 0.0364929 0.1218447 0.0447825 -0.2495954 -0.4543927 0.0313706 -0.6079937 0.0166767 -0.3944607 -0.0370275 -0.3648792 -0.0123629 -0.8071207 -0.9117306 -0.0638389 0.0754709 -0.0266618 -0.3422789 0.0538702 -0.4405167 0.0011675 -0.9995387 -0.952752 -0.1098687 0.2434595 -0.0960931 -0.0516123 0.0407497 0.0257504 0.0181239 -0.2759117 0.4803338 0.0039913 0.5976204 0.0386136 0.0859112 0.0183302 0.0605656 -0.0358845 0.7651491 2.6687861 0.2571049 -0.0467181 0.2059563 0.2048806 -0.0605476 0.6658283 0.0123468 0.9739601 0.3272612 0.052759 -0.1483531 0.0246221 -0.0890365 -0.0231698 0.2680178 0.0201687 0.0277635 -0.1348825 0.0296547 -0.3265667 0.0712927 -0.1428947 -0.0455875 -0.855593 -0.1006743 -0.0258948 -1.920758 -0.1478859 -0.3973188 -0.1741645 -0.2126745 -0.0518887 -0.0926073 -0.0200261 -0.0577809 -0.304287 0.0094758 -0.3158539 -0.0075991 -0.2033894 -0.0454338 -0.0344065 -0.0164308 -0.0082639 1.1633841 0.1020653 0.2857926 0.1043154 -0.028497 0.0146878 0.2376311 0.0099349 0.1656144 -0.2501547 -0.0199833 0.2244936 -0.0290609 -0.1977122 0.0191656 0.3645471 0.0334627 -0.1283037 0.0518996 0.0147104 0.0457775 0.0287994 -0.1119214 -0.0172403 -0.1796162 -0.04047 0.2331807 0.2319201 0.0372515 0.0211494 0.0082181 -0.1302358 0.0004339 0.3962488 0.0392251 -0.1073495 -0.5221066 -0.0452167 0.0648568 -0.0703521 -0.1482493 -0.0045449 0.3442904 0.0251901 -0.0071342 -0.3040623 -0.001638 0.0381744 0.0442198 -0.3044157 -0.0403898 -0.5201876 -0.0988937 0.2285887 0.2180999 0.0036026 0.0549221 0.0085109 0.1495965 0.0140799 -0.0070149 0.0071307 0.0217901 0.1959285 0.0045492 -0.0354389 0.0110478 0.1743761 0.0098504 -0.117667 0.0009595 -0.0024588 0.1186389 -0.0045337 0.0100558 -0.002926 0.1511278 0.0124177 0.0239671 0.0132823 0.0077179 0.0578482 -0.0112114 -0.009048 -0.015818 0.1686763 0.0187874 0.0640579 0.0261984 -0.1367807 -0.0558256 -0.0174008 -0.0935907 -0.0158583 0.1677192 0.0014471 -0.1148856 -0.0006377 -0.0087762 -0.1167303 -0.0315323 0.0512209 -0.0326705 0.1522394 0.0100596 0.065918 0.0115899 0.0809556 0.0385637 -0.0226703 0.0791552 -0.0238941 0.1831278 0.0203641 0.0995798 0.0226414 0.0418792 0.0711558 -0.0102599 -0.0348904 -0.0058034 0.1932418 0.017311 -0.0944073 0.0110482 -0.0594428 0.0100522 -0.0222441 -0.0047846 -0.0198516 0.2184817 0.0105929 -0.0240517 0.0084305 0.0882348 0.1273051 -0.0364922 0.1802803 -0.0321937 0.3721723 0.0271897 0.107586 0.0196972 0.2395179 unknown
polarizability: 347.9065924|27.9371246|64.6835189|23.481992|-5.67479|174.63159 unknown
InChI: InChI=1S/C13H10O2S/c14-12-6-2-1-5-11(12)13(15)8-7-10-4-3-9-16-10/h1-9,14H
charge 0 multiplicity 1
26 atoms
S  4.638762 0.277012 -1.021905
O  -1.386486 -0.533247 1.701172
O  -0.461868 -0.159655 -2.512454
C  -1.993429 -0.444692 -0.681854
C  -2.368864 -0.570921 0.690219
C  -0.599834 -0.262533 -1.243394
C  -3.043763 -0.492938 -1.644064
C  3.06616 0.03661 -0.132416
C  0.578427 -0.204731 -0.349048
C  -3.728043 -0.735175 1.060558
C  1.835115 -0.034608 -0.884931
C  -4.39281 -0.655377 -1.286965
C  -4.737904 -0.777555 0.0807
C  3.308525 -0.050703 1.245451
C  4.68937 0.066541 1.609249
C  5.536966 0.246304 0.519801
H  -2.739656 -0.39439 -2.691477
H  0.411798 -0.299264 0.724915
H  1.889707 0.05223 -1.97974
H  -3.991576 -0.830281 2.12305
H  -5.168386 -0.686902 -2.05848
H  -5.782906 -0.905157 0.383336
H  2.50496 -0.197069 1.971284
H  5.050332 0.019905 2.639362
H  6.619221 0.362877 0.508714
H  -1.80892 -0.631583 2.590819
