program: Gaussian 09
title: 000240063
version: EM64L-G09RevD.01
frameworkgroup: C1[X(C19H20N4O4)]
method: RPBEPBE
basis: SDD
operation: Freq
keyword: #p
keyword: freq=noraman
keyword: PBEPBE/SDD
title: #p freq=noraman PBEPBE/SDD
converged: YES YES NO NO
title: Mulliken charges:
elementType: O O O O N N N N C C C C C C C C C C C C C C C C C C C H H H H H H H H H H H H H H H H H H H H
charge: -0.222735 -0.222592 -0.295817 -0.295888 -0.493682 -0.495750 -0.422408 -0.420389 0.318920 0.308832 0.517740 -0.672549 -0.331056 -0.368331 -0.856091 -0.455213 -0.457700 0.290367 0.293091 0.353712 0.355661 -0.417063 -0.417431 -0.254921 -0.254972 -0.172008 -0.171794 0.214582 0.305600 0.306097 0.306227 0.226548 0.228243 0.242963 0.284864 0.235411 0.278351 0.278224 0.235443 0.286406 0.285671 0.260012 0.259857 0.253172 0.253014 0.259721 0.259659
chargesum: 0.00000
title: Mulliken charges with hydrogens summed into heavy atoms:
elementType: O O O O N N N N C C C C C C C C C C C C C C C C C C C
charge: -0.222735 -0.222592 -0.295817 -0.295888 -0.187455 -0.210886 -0.136001 -0.134718 0.318920 0.308832 0.517740 -0.457967 -0.025456 -0.062234 -0.158338 0.058549 0.055967 0.290367 0.293091 0.353712 0.355661 -0.157051 -0.157575 -0.001749 -0.001958 0.087714 0.087866
polarizability: 4.44570269e+02 2.99824616e+00 1.92860121e+02 1.66317051e+01 -6.22988553e-01 1.74852573e+02
1716.lowfreq: -3.9178 -0.0011 -0.0004 0.0010 0.8482 2.3239 10.0724 11.9311 21.1595
frequency: 9.7915 11.9289 21.1437 29.2217 33.7433 40.3034 42.1386 53.2674 67.8740 70.6739 79.9654 131.6129 148.0947 169.3741 171.6516 188.5416 192.3631 223.8957 228.1431 238.5524 273.2151 293.4157 298.7028 318.2046 321.1971 329.6204 358.6914 391.8094 424.9672 440.9733 450.9867 475.1343 534.5275 557.4154 570.1278 590.3233 594.0932 596.2687 596.6875 623.7859 643.9769 675.4418 683.9969 701.9509 703.4049 724.9510 730.9329 731.8574 739.1282 760.8241 780.3802 815.8444 820.2386 822.9793 855.0662 866.5714 867.1951 875.0081 875.2460 877.6796 878.1228 878.6589 909.4425 936.9049 952.2664 987.3437 997.3921 1000.4534 1007.4238 1023.0091 1025.5085 1040.9335 1048.3928 1048.5448 1085.5997 1106.8879 1129.3108 1133.6942 1134.0818 1184.6519 1185.3573 1190.6488 1204.0734 1206.4609 1222.1722 1222.9883 1244.4833 1255.3021 1256.5140 1295.7366 1311.2003 1340.0863 1341.7605 1366.6538 1367.6807 1373.9668 1396.1792 1407.9628 1453.6068 1468.8865 1470.4278 1474.2096 1479.2165 1480.6751 1488.4315 1489.2457 1493.7263 1509.2833 1539.4632 1587.8476 1587.9246 1598.5291 1633.3535 1641.5039 1643.5945 2950.2939 2983.1569 2983.6423 3018.0379 3045.2540 3045.3015 3082.8227 3097.9456 3184.3598 3200.1925 3216.5857 3216.6533 3232.0011 3232.1106 3267.4567 3267.6683 3525.8499 3540.5527 3552.7711 3553.2577
redmass: 6.1015 6.1606 6.2368 4.2581 4.5154 4.8756 5.8810 7.8517 6.1374 5.2212 5.4490 4.9388 3.9089 3.1888 2.7511 4.8209 1.5770 6.0048 1.7302 3.9064 4.7963 4.1126 3.1761 3.0563 2.7823 1.9769 1.5843 3.8764 3.4773 2.9832 3.9058 3.6211 5.1078 1.3436 1.2979 4.7735 3.1584 3.2281 2.4060 4.4274 4.7336 5.8527 5.4572 10.4751 10.0814 3.5085 1.2812 1.2697 4.6710 4.2441 4.9755 2.0232 1.3131 2.0958 1.4475 4.6623 4.8548 2.2689 2.0000 1.4161 2.0184 2.2061 3.9779 2.5993 2.5938 1.8351 2.6311 1.3001 2.0148 1.6468 1.8724 1.5054 3.2042 3.1766 4.5546 3.8958 1.9636 1.5598 1.6076 1.7291 1.7432 1.5984 1.9418 1.8190 2.0270 2.1293 1.6550 1.4177 1.4175 1.6229 3.2886 1.5045 1.4712 2.4200 2.1200 3.5605 1.3076 3.0116 1.8551 1.1398 1.1081 1.4601 1.9127 1.0456 3.8404 4.4538 1.6880 2.5944 2.1467 6.7278 6.7350 6.1600 5.7505 3.8961 4.9382 1.0398 1.0628 1.0626 1.0979 1.0979 1.0980 1.0948 1.0908 1.0901 1.0959 1.0928 1.0929 1.0981 1.0981 1.1084 1.1084 1.0761 1.0760 1.0775 1.0770
irintensity: 1.0376 0.0139 0.0113 0.8595 1.6704 0.3205 2.8983 0.1845 15.5169 5.8029 0.0095 2.3063 0.0298 1.8599 0.3731 0.4614 2.4058 2.6665 1.1131 8.5910 48.5128 3.3318 5.6375 2.2369 26.0221 0.6198 53.9804 2.5485 6.2138 6.5501 4.5790 4.7508 1.8220 288.9004 26.5643 5.9374 0.3322 9.2153 45.0830 26.2681 0.9568 0.6942 2.9988 14.4658 14.0891 5.3369 91.2181 78.8532 12.9377 16.5624 5.9551 16.2245 47.3434 4.7841 13.9605 0.0035 15.8272 0.0074 2.4649 66.6802 1.6705 19.9378 4.0028 11.1880 1.8626 15.2834 21.7401 0.3907 15.2703 19.9893 31.7376 7.5099 0.2549 0.3365 11.0825 6.5051 4.8518 26.1913 9.4459 3.6457 40.6722 173.1480 827.6329 42.6736 78.4696 3.5425 67.6053 152.4659 3.5745 147.6867 9.5158 1.0444 20.6168 4.7889 16.9418 55.6030 29.7719 19.6350 49.9612 125.6104 75.1372 546.7116 74.6065 16.7829 20.7795 7.7986 1148.0313 656.0337 87.8006 12.3466 2.0297 25.2689 86.1261 46.8493 188.2868 43.8253 85.8730 49.2219 23.9865 9.6449 8.9328 13.8563 33.9932 7.8840 2.9862 5.4022 5.0490 0.5243 0.5094 0.6188 0.5976 5.7021 14.7023 28.7805 21.8091
temp: 298.150 k
press: 1.00000 atm
elementType: 8 8 8 8 7 7 7 7 6 6 6 6 6 6 6 6 6 6 6 6 6 6 6 6 6 6 6 1 1 1 1 1 1 1 1 1 1 1 1 1 1 1 1 1 1 1 1
symmnumber: 1
zpe: 961072.6 jmol-1
zpe.correction: 0.366053 hartree
zpe.thermalcorrener: 0.391842 hartree
zpe.thermalcorrenthalpy: 0.392787 hartree
zpe.thermalcorrgfe: 0.304059 hartree
zpe.sumelectzpe: -1253.969675 hartree
zpe.sumelectthermal: -1253.943886 hartree
zpe.sumelectthermalent: -1253.942942 hartree
zpe.sumelectthermalfe: -1254.031669 hartree
dipole: 0.2632 8.0459 -0.3497
dipole: 8.0578
quadrupole: -88.6721 -156.1970 -150.8619
quadrupole: -0.0755 12.1344 -0.0213
quadrupole: 43.2382 -24.2866 -18.9516 -0.0755 12.1344 -0.0213
hfenergy: -1254.3357287 hartree
pointgroup: C01 [X(C19H20N4O4)]
dipole: -0.1029195 3.1671935 0.0908153 debye
polarizability: 445.4101464|-2.5227724|192.8712724|7.210398|0.4375929|174.0015443 unknown
InChI: InChI=1S/C19H20N4O4/c1-13-10-14(22-18(24)20-11-15-4-2-8-26-15)6-7-17(13)23-19(25)21-12-16-5-3-9-27-16/h2-10,20-23H,11-12H2,1H3
charge 0 multiplicity 1
47 atoms
O  -7.113487 -0.498746 1.335774
O  7.204924 -0.323749 -1.374891
O  -3.349963 -1.530823 -0.471144
O  3.492403 -1.520117 0.393376
N  -2.766633 0.76302 -0.363969
N  2.869843 0.761187 0.453264
N  -4.977474 0.114832 -0.778595
N  5.096605 0.127063 0.806956
C  -0.654573 1.937186 -0.008314
C  -1.357003 0.700297 -0.158204
C  1.462333 0.680186 0.245309
C  0.740666 1.90152 0.191243
C  -0.639816 -0.521974 -0.102227
C  0.754347 -0.538636 0.0946
C  -1.383235 3.270608 -0.06132
C  -6.065642 -0.868638 -0.894349
C  6.201649 -0.843435 0.845746
C  -3.663473 -0.303507 -0.530512
C  3.788277 -0.29538 0.537987
C  -7.267684 -0.520096 -0.070213
C  7.384217 -0.427948 0.024322
C  -8.585052 -0.221173 -0.386637
C  8.702644 -0.128885 0.336206
C  -9.293461 -0.00451 0.859755
C  9.385908 0.173112 -0.906473
C  -8.371433 -0.177662 1.876776
C  8.44847 0.048294 -1.916477
H  1.276353 2.854108 0.306592
H  -1.189156 -1.458569 -0.212136
H  1.298827 -1.483465 0.129714
H  -3.16232 1.703932 -0.374807
H  -1.885769 3.433804 -1.036822
H  -2.150644 3.360113 0.734802
H  -0.679718 4.107808 0.07879
H  3.239396 1.710587 0.533661
H  -6.396291 -0.976195 -1.946203
H  -5.625163 -1.836192 -0.588863
H  5.770249 -1.797844 0.489883
H  6.551839 -1.007837 1.883778
H  -5.218304 1.104239 -0.849251
H  5.321623 1.1136 0.940862
H  -9.002314 -0.16715 -1.390733
H  9.136626 -0.129269 1.334641
H  -10.345668 0.245438 0.979726
H  10.432251 0.445579 -1.028711
H  -8.415764 -0.121092 2.960736
H  8.47269 0.171379 -2.995544
