program: Gaussian 09
title: 000240084
version: EM64L-G09RevD.01
frameworkgroup: C1[X(C20H22N2O4)]
method: RPBEPBE
basis: SDD
operation: Freq
keyword: #p
keyword: freq=noraman
keyword: PBEPBE/SDD
title: #p freq=noraman PBEPBE/SDD
converged: YES YES NO NO
title: Mulliken charges:
elementType: O O O O N N C C C C C C C C C C C C C C C C C C C C H H H H H H H H H H H H H H H H H H H H H H
charge: -0.400116 -0.239855 -0.324637 -0.305045 -0.405106 -0.430998 -0.387270 -0.391677 -0.128458 -0.442285 -0.330305 0.140143 0.188006 0.170131 0.273827 0.237752 -0.339452 -0.366778 -0.354142 -0.369166 -0.238995 -0.237643 -0.224000 -0.229124 -0.246607 -0.243520 0.220713 0.215159 0.240018 0.216871 0.282820 0.214522 0.205827 0.229653 0.235939 0.343891 0.375760 0.391764 0.281427 0.234894 0.277170 0.265934 0.241215 0.234334 0.235731 0.227246 0.227308 0.227124
chargesum: 0.00000
title: Mulliken charges with hydrogens summed into heavy atoms:
elementType: O O O O N N C C C C C C C C C C C C C C C C C C C C
charge: -0.008353 -0.239855 -0.324637 -0.305045 -0.061215 -0.055238 0.048602 0.065213 0.154362 -0.021936 0.135287 0.140143 0.188006 0.170131 0.273827 0.237752 -0.058025 -0.131883 -0.076972 -0.103232 0.002220 -0.003309 0.011731 -0.001877 -0.019300 -0.016396
polarizability: 2.99094485e+02 -1.99281183e+01 2.89688094e+02 1.53906971e+01 7.82632583e+00 1.38002533e+02
1716.lowfreq: -6.9869 -3.5145 0.0002 0.0008 0.0010 2.8146 15.6523 18.9268 36.2461
frequency: 15.2762 18.8213 36.1981 43.1932 51.8490 55.9930 62.1757 67.4803 75.6149 91.0195 123.2795 133.4958 143.3947 170.1540 176.7196 209.2404 227.3820 238.3581 243.7313 270.7353 284.3200 297.7575 327.2795 369.8486 380.6345 402.7084 404.9355 432.0119 437.5691 457.1514 484.3974 508.2751 551.6935 577.8742 607.8832 613.1662 614.6973 630.2473 660.9990 663.4319 682.1782 689.8823 690.8765 702.5310 708.5076 730.3641 745.8028 792.4703 794.2320 813.6416 817.3997 840.7869 857.1623 861.0072 866.7892 933.9021 939.1473 943.9112 954.2915 961.9237 986.0308 987.9082 989.7808 991.9432 1005.8009 1007.9610 1020.2724 1025.3205 1035.1420 1060.0623 1072.3742 1082.4215 1087.8671 1088.7295 1099.9908 1114.9555 1147.2350 1160.2096 1170.1017 1175.4380 1192.6961 1194.4244 1196.0379 1209.0379 1227.8500 1252.9598 1277.5116 1282.5424 1299.9260 1305.4917 1321.4906 1326.3089 1329.1510 1335.0743 1350.0926 1354.1836 1370.5121 1383.8372 1384.7777 1431.8474 1433.1642 1455.6443 1460.0485 1474.9735 1476.4241 1476.9733 1488.8653 1508.3550 1520.1390 1560.1457 1562.3982 1598.0755 1601.9031 1610.5081 1611.2984 1648.0456 2975.1850 2981.8300 2985.6286 2995.9552 3020.4816 3032.2164 3037.0360 3052.4558 3064.5130 3119.5210 3120.2978 3132.0877 3135.1296 3145.5352 3148.4581 3154.0216 3161.6896 3164.9476 3172.4741 3427.5227 3515.7127 3518.6202
redmass: 5.0762 5.4365 4.4942 6.4044 6.3897 4.9396 7.4224 5.5081 5.7675 5.5682 6.2371 4.3342 4.2010 3.7350 4.1069 4.8401 3.9064 3.1496 2.5899 3.6227 4.8460 5.6633 4.4923 4.0717 4.0124 2.8125 2.8538 4.0087 3.9837 4.0032 4.5355 3.1240 3.5326 1.9023 1.9888 6.0760 6.4019 1.4937 5.2247 4.3325 4.0116 4.7011 3.2792 1.4993 1.5518 1.2042 1.3818 2.3483 2.2458 2.4736 3.6865 2.8914 1.2823 2.8001 1.2575 2.6609 1.5696 1.4415 2.4382 2.0405 1.6746 2.8781 3.4267 1.8164 1.3357 1.3387 2.9395 2.4080 2.3181 2.2621 3.0679 1.5939 1.8223 2.0934 2.6367 2.5597 2.5429 2.7816 1.0711 1.0570 1.3978 1.1299 1.1468 1.2733 1.3384 1.2503 1.6773 1.9081 1.3623 1.4070 1.3282 1.3060 1.2996 1.3588 2.2205 1.5764 1.5060 8.4965 8.6836 2.2422 2.2374 1.1079 1.1274 1.6240 1.7070 1.3901 1.0748 2.2771 2.0077 5.3016 6.2471 6.2854 6.0379 5.9766 5.8105 8.4786 1.0597 1.0620 1.0614 1.0632 1.1003 1.0955 1.0880 1.1003 1.1002 1.0881 1.0849 1.0885 1.0873 1.0930 1.0922 1.0960 1.0958 1.1001 1.1003 1.0818 1.0651 1.0760
irintensity: 0.4184 0.3745 0.1555 1.3965 2.6055 0.3150 1.5727 1.4690 3.6752 3.1008 8.9315 1.1767 2.9745 0.5610 0.6063 8.7280 3.8084 1.8849 1.7027 10.0334 0.6870 4.4168 0.2097 1.7490 7.1350 0.4090 0.1126 16.8103 1.1526 14.1053 2.3292 1.8648 42.9362 51.8415 89.2979 2.5374 0.6213 55.1341 13.5714 19.4250 14.8860 20.6776 43.8439 137.9803 25.9231 123.2230 50.9490 16.1832 32.7309 3.7681 5.2972 3.3258 5.4649 2.6545 8.8708 5.0299 6.6134 7.1301 6.9052 6.9560 1.6682 2.0153 1.2092 0.7861 1.8447 1.0407 17.8876 8.1942 71.4962 158.8489 27.3792 27.7940 15.3483 1.9062 3.6898 21.2211 0.8818 2.3386 1.4335 0.0334 2.4300 0.5334 5.0230 5.9088 14.1029 3.7662 19.5692 61.2024 53.3832 33.0854 2.2683 23.2951 9.8084 1.1586 175.4538 2.1341 1.2769 3.2321 2.4428 0.7440 2.8513 72.8673 6.2394 107.7442 25.7213 22.8415 10.5684 347.6686 268.9419 188.1586 129.4871 85.2549 21.9056 17.0107 0.8108 162.3915 21.2061 11.1358 45.1270 31.4614 34.3554 20.4691 7.3873 29.6996 68.1801 5.6929 1.7887 17.9170 2.1166 11.0094 22.0350 12.6964 10.5052 24.5497 17.9124 342.4865 55.8807 31.4224
temp: 298.150 k
press: 1.00000 atm
elementType: 8 8 8 8 7 7 6 6 6 6 6 6 6 6 6 6 6 6 6 6 6 6 6 6 6 6 1 1 1 1 1 1 1 1 1 1 1 1 1 1 1 1 1 1 1 1 1 1
symmnumber: 1
zpe: 1013065.8 jmol-1
zpe.correction: 0.385856 hartree
zpe.thermalcorrener: 0.410228 hartree
zpe.thermalcorrenthalpy: 0.411172 hartree
zpe.thermalcorrgfe: 0.328518 hartree
zpe.sumelectzpe: -1183.888551 hartree
zpe.sumelectthermal: -1183.864180 hartree
zpe.sumelectthermalent: -1183.863236 hartree
zpe.sumelectthermalfe: -1183.945889 hartree
dipole: 6.4826 3.7319 0.0318
dipole: 7.4802
quadrupole: -144.0750 -143.6144 -155.1411
quadrupole: -27.0387 1.3686 -3.3746
quadrupole: 3.5352 3.9958 -7.5309 -27.0387 1.3686 -3.3746
hfenergy: -1184.2744073 hartree
pointgroup: C01[X(C20H22N2O4)]
dipole: -2.2622756 -1.875777 -0.1560949 debye
polarizability: 306.0990438|-16.3157909|284.0266642|-10.6861998|-1.9427588|136.6594043 unknown
InChI: InChI=1S/C20H22N2O4/c23-18(15-9-3-1-4-10-15)21-14-8-7-13-17(20(25)26)22-19(24)16-11-5-2-6-12-16/h1-6,9-12,17,21-22,25H,7-8,13-14H2
charge 0 multiplicity 1
48 atoms
O  -5.356459 1.073931 1.011499
O  -5.15709 -0.995358 -0.026541
O  -0.456333 -0.010941 0.539813
O  2.812878 3.862755 -0.528222
N  -2.477097 -0.646969 -0.409018
N  0.996248 2.548368 0.044282
C  -3.240227 1.687966 -1.050945
C  -1.855397 2.339273 -1.268649
C  -3.22234 0.543995 0.017692
C  -1.398356 3.218913 -0.080463
C  0.069782 3.673927 -0.180414
C  -4.649926 0.096462 0.320607
C  -1.166777 -0.89169 -0.056258
C  2.351177 2.74152 -0.12249
C  -0.621889 -2.243948 -0.424792
C  3.276745 1.587889 0.193025
C  0.776701 -2.371262 -0.623377
C  -1.451888 -3.390523 -0.549188
C  4.625771 1.715207 -0.228305
C  2.881155 0.424092 0.904045
C  1.335192 -3.620294 -0.964688
C  -0.888837 -4.640971 -0.883454
C  0.50437 -4.757761 -1.098655
C  5.562405 0.696395 0.0416
C  3.823144 -0.593892 1.178658
C  5.16376 -0.464101 0.747379
H  -3.966451 2.454465 -0.718239
H  -3.616655 1.263209 -2.001996
H  -1.102232 1.556443 -1.470925
H  -1.904273 2.96676 -2.180636
H  -2.757844 0.928978 0.943508
H  -1.534102 2.67563 0.875492
H  -2.041565 4.118939 -0.02627
H  0.279264 4.122166 -1.171499
H  0.278546 4.468973 0.562739
H  -3.022531 -1.367862 -0.890232
H  0.597478 1.63837 0.310584
H  -6.290952 0.77004 1.171768
H  1.413092 -1.488397 -0.510348
H  -2.528564 -3.33048 -0.346789
H  4.908839 2.632114 -0.755916
H  1.851856 0.299873 1.257661
H  2.41516 -3.705065 -1.12577
H  -1.533035 -5.522862 -0.966398
H  0.939026 -5.728687 -1.360539
H  6.600765 0.806923 -0.29079
H  3.509799 -1.483485 1.737662
H  5.891466 -1.254034 0.966291
