program: Gaussian 09
title: 000240044
version: EM64L-G09RevD.01
frameworkgroup: C1[X(C6H13N5O4)]
method: RPBEPBE
basis: SDD
operation: Freq
keyword: #p
keyword: freq=noraman
keyword: PBEPBE/SDD
title: #p freq=noraman PBEPBE/SDD
converged: YES YES NO NO
title: Mulliken charges:
elementType: O O O O N N N N N C C C C C C H H H H H H H H H H H H H
charge: -0.411896 -0.238996 -0.245692 -0.190158 -0.093925 -0.626557 0.118012 -0.650714 -0.400712 -0.361870 -0.415247 -0.152820 -0.359490 0.156461 0.271461 0.244210 0.225257 0.216896 0.236024 0.265175 0.244326 0.259619 0.277880 0.313932 0.380798 0.371826 0.325278 0.240923
chargesum: 0.00000
title: Mulliken charges with hydrogens summed into heavy atoms:
elementType: O O O O N N N N N C C C C C C
charge: -0.031098 -0.238996 -0.245692 -0.190158 -0.093925 -0.034746 0.118012 0.046389 -0.159789 0.107596 0.037674 0.106799 0.150011 0.156461 0.271461
polarizability: 1.27089392e+02 3.81447427e+00 1.35100285e+02 -1.73493611e+01 -3.62516030e+00 9.46699916e+01
1716.lowfreq: -11.4218 -4.7267 -0.0012 -0.0011 -0.0010 6.6299 19.6227 27.5135 46.3883
frequency: 19.3810 27.4074 46.3826 54.6078 60.3264 78.1274 82.9434 138.5155 179.4867 207.4709 221.9762 277.0364 299.8702 333.2682 379.2185 387.2511 415.3837 419.4413 423.3400 447.7651 467.6350 516.3390 564.0837 574.6400 628.3576 638.2524 651.4839 658.9844 671.3740 718.1756 740.1919 745.5220 765.2480 798.5212 836.6148 918.0425 975.3821 1012.6662 1035.6580 1047.6252 1053.3712 1062.8459 1069.3223 1123.8160 1150.4258 1162.9829 1186.3485 1214.1876 1232.2473 1264.6406 1291.7220 1300.9927 1327.0780 1351.4972 1360.7822 1373.0110 1389.0876 1420.1464 1436.0113 1460.6597 1472.6082 1583.1622 1603.2674 1626.1778 1668.8460 2970.0243 2984.6194 2998.0270 3035.1863 3041.3706 3064.7260 3114.7081 3410.3079 3433.2449 3502.2968 3516.8601 3644.6824 3661.4074
redmass: 6.2566 5.8947 6.8487 7.1585 7.4325 4.9175 7.1201 2.3663 4.2698 3.4895 1.3953 2.7242 4.0037 3.3837 3.1802 4.0100 2.0037 2.1407 1.5209 7.7632 1.7662 2.8258 2.9330 2.3785 2.0895 2.4419 3.8485 5.4068 1.7745 3.5506 1.2547 1.3264 4.4879 2.9407 1.7786 2.8045 2.5402 1.8764 2.7325 3.1918 2.1858 2.0852 2.0291 5.2251 1.4769 4.8368 2.7188 1.4834 1.3738 1.6312 1.1671 1.2793 1.1674 2.2014 1.6152 1.4589 1.8618 2.3901 1.4055 1.0895 1.0974 1.2182 1.2724 5.8178 4.1621 1.0677 1.0772 1.0583 1.0979 1.0616 1.1031 1.1041 1.0770 1.0555 1.0450 1.0640 1.1004 1.0958
irintensity: 0.5895 0.4238 2.9574 2.4191 2.0836 0.6098 1.0349 0.1349 1.3140 0.6002 55.4252 4.0350 9.0165 15.3244 40.2638 5.2954 161.8280 63.6405 25.4807 8.3088 210.1288 5.9022 33.8543 85.5723 90.3289 111.4804 14.0585 52.5747 183.7334 23.8257 23.2592 38.0034 2.9786 0.4349 11.3255 10.6282 73.9703 139.4699 37.8538 129.8717 77.6185 55.3392 34.9711 40.7786 13.0829 236.8609 13.4227 26.4277 21.1347 12.2333 7.1002 4.9988 25.7567 31.5151 3.0162 39.1048 11.4638 202.7963 128.5072 3.3787 13.9487 135.5369 128.9639 240.6726 140.7936 15.7552 44.8311 15.5235 8.6737 16.1222 23.5868 2.0844 24.1285 85.9992 10.3886 28.2466 15.0973 74.6017
temp: 298.150 k
press: 1.00000 atm
elementType: 8 8 8 8 7 7 7 7 7 6 6 6 6 6 6 1 1 1 1 1 1 1 1 1 1 1 1 1
symmnumber: 1
zpe: 568385.9 jmol-1
zpe.correction: 0.216487 hartree
zpe.thermalcorrener: 0.233032 hartree
zpe.thermalcorrenthalpy: 0.233976 hartree
zpe.thermalcorrgfe: 0.169710 hartree
zpe.sumelectzpe: -809.801095 hartree
zpe.sumelectthermal: -809.784550 hartree
zpe.sumelectthermalent: -809.783605 hartree
zpe.sumelectthermalfe: -809.847871 hartree
dipole: -1.6788 3.7066 -1.2218
dipole: 4.2485
quadrupole: -89.1015 -83.4632 -92.0948
quadrupole: -10.6625 -7.1149 6.5732
quadrupole: -0.8817 4.7567 -3.8750 -10.6625 -7.1149 6.5732
hfenergy: -810.0175815 hartree
pointgroup: C01 [X(C6H13N5O4)]
dipole: 0.6985173 -1.3418948 -0.7108308 debye
polarizability: 121.2030877|-1.7016945|131.3360962|21.7305893|11.2080736|104.3204846 unknown
InChI: InChI=1S/C6H13N5O4/c7-4(5(12)13)2-1-3-10(6(8)9)11(14)15/h4,8,12H,1-3,7,9H2
charge 0 multiplicity 1
28 atoms
O  -3.875735 -1.381836 -1.282087
O  -3.656006 -0.891458 0.976971
O  3.327604 0.713026 1.560523
O  1.780162 2.076584 0.587297
N  1.886493 -0.116358 -0.109004
N  -3.204131 1.7825 0.396899
N  2.355474 0.932168 0.721761
N  3.368947 -1.790135 0.825854
N  1.671588 -2.317189 -0.830262
C  -0.601372 0.21759 -0.377325
C  -1.686529 0.697028 -1.363028
C  -3.112808 0.838259 -0.713441
C  0.78822 0.246171 -1.046808
C  -3.574505 -0.527524 -0.216941
C  2.330536 -1.502805 -0.03761
H  -0.808837 -0.816403 -0.044635
H  -0.604873 0.871317 0.51485
H  -1.416686 1.697227 -1.759363
H  -1.758944 0.009983 -2.227999
H  0.839617 -0.504465 -1.85013
H  1.01094 1.249882 -1.446241
H  -3.801703 1.12969 -1.531782
H  -2.737408 2.679738 0.26749
H  -3.127649 1.372143 1.329782
H  -4.135695 -2.27405 -0.925243
H  3.77731 -1.043299 1.396893
H  3.679468 -2.754259 0.907648
H  2.002124 -3.296723 -0.787867
