program: Gaussian 09
title: 000240021
version: EM64L-G09RevD.01
frameworkgroup: C1[X(C12H12N6)]
method: RPBEPBE
basis: SDD
operation: Freq
keyword: #pfreq=noraman
keyword: PBEPBE/SDD
title: #p freq=noraman PBEPBE/SDD
converged: YES YES NO NO
title: Mulliken charges:
elementType: N N N N N N C C C C C C C C C C C C H H H H H H H H H H H H
charge: -0.169130 -0.169130 -0.175984 -0.175982 -0.606568 -0.606569 0.120206 0.120206 0.148825 0.148823 -0.335854 -0.335853 -0.162250 -0.162250 -0.201800 -0.201800 -0.321994 -0.321994 0.254160 0.254160 0.237536 0.237536 0.229954 0.229954 0.237391 0.237392 0.400655 0.344854 0.344854 0.400654
chargesum: 0.00000
title: Mulliken charges with hydrogens summed into heavy atoms:
elementType: N N N N N N C C C C C C C C C C C C
charge: -0.169130 -0.169130 -0.175984 -0.175982 0.138941 0.138940 0.120206 0.120206 0.148825 0.148823 -0.081694 -0.081694 0.075286 0.075286 0.028153 0.028153 -0.084603 -0.084602
polarizability: 3.72955262e+02 -1.77802490e+01 1.72685450e+02 -8.85819396e-05 -1.12399849e-05 6.66672826e+01
1716.lowfreq: 0.0004 0.0005 0.0005 5.1212 7.6706 18.5351 35.2312 54.5713 69.8914
frequency: 35.2312 54.5713 69.8914 99.3308 99.8844 132.4585 169.8836 216.8440 229.5269 269.3861 281.1428 330.4328 363.8435 416.5382 417.7952 485.7875 508.1398 525.1181 538.0689 595.2578 613.4330 625.2526 640.4911 704.5893 720.9971 723.6078 738.9464 741.8191 759.9813 790.1216 792.0872 819.2245 835.5393 874.7919 880.6914 880.8264 893.6656 894.6909 954.8339 954.9930 963.1202 966.4801 995.0224 995.0462 1031.9532 1032.7735 1086.6748 1089.3757 1089.6814 1093.0734 1156.8960 1157.0510 1255.2275 1265.1004 1289.6682 1299.6317 1303.9734 1306.6981 1362.7302 1396.1561 1415.5653 1436.1257 1439.6847 1449.2657 1458.7677 1491.8479 1540.6800 1544.3509 1579.6238 1586.5275 1605.7071 1631.7220 3125.6355 3125.7667 3141.0433 3141.0461 3168.9459 3169.0019 3180.1737 3180.2351 3245.5282 3247.2517 3528.1830 3529.8036
redmass: 5.7607 4.2584 5.3532 4.7741 6.0649 6.1018 5.4447 6.1691 5.5192 3.9502 5.5665 3.3554 4.4055 3.3914 3.5277 3.7477 5.5434 5.1140 2.8688 4.3343 7.7383 6.9426 7.2857 4.6600 1.2097 1.2251 1.7600 1.7081 8.4063 1.8831 2.0184 7.5284 7.3329 4.3008 1.2018 1.1697 1.2645 1.3016 1.4296 1.4300 6.5735 6.6402 1.3269 1.3268 2.3560 2.2944 2.1643 1.7570 1.6336 1.8599 1.0818 1.0828 2.1413 1.9004 2.0130 3.6338 3.7914 3.3575 3.1981 1.4945 1.9289 1.9939 1.9101 2.3129 1.5909 3.8473 5.2666 5.3200 5.6597 5.8187 7.0294 5.5517 1.0889 1.0890 1.0895 1.0895 1.0952 1.0952 1.0996 1.0997 1.0572 1.0574 1.0939 1.0948
irintensity: 1.5233 0.0317 0.2847 0.0000 0.0000 11.7788 0.0000 0.0000 3.8746 49.6351 0.0012 0.0000 3.3787 5.2334 0.0000 5.9912 1.6699 0.0000 0.0000 10.2431 0.0001 2.9927 0.0000 7.7496 126.3189 0.0017 0.0003 266.6370 0.0001 104.7243 0.0000 15.7174 0.0000 0.0108 44.0226 0.0006 0.0002 109.2278 1.8195 0.0000 31.5805 0.0000 0.0002 1.1793 7.7182 0.0000 126.8472 13.8538 0.0000 0.0001 0.0000 12.9618 3.3767 0.0000 6.0118 0.0000 4.4550 0.0000 104.6020 0.0000 3.7743 762.2249 0.0001 0.0000 68.8934 0.0000 158.9329 0.0000 1235.6273 0.0000 510.4438 0.0000 49.1828 0.0180 16.5773 12.9354 57.3528 0.0082 27.8868 0.0007 0.0002 217.3911 0.0000 450.0554
temp: 298.150 k
press: 1.00000 atm
elementType: 7 7 7 7 7 7 6 6 6 6 6 6 6 6 6 6 6 6 1 1 1 1 1 1 1 1 1 1 1 1
symmnumber: 1
zpe: 608770.8 jmol-1
zpe.correction: 0.231869 hartree
zpe.thermalcorrener: 0.246464 hartree
zpe.thermalcorrenthalpy: 0.247408 hartree
zpe.thermalcorrgfe: 0.189287 hartree
zpe.sumelectzpe: -791.750017 hartree
zpe.sumelectthermal: -791.735421 hartree
zpe.sumelectthermalent: -791.734477 hartree
zpe.sumelectthermalfe: -791.792598 hartree
dipole: 0.0000 0.0000 0.0040
dipole: 0.0040
quadrupole: -71.2797 -91.2660 -111.6729
quadrupole: -1.0182 0.0000 0.0000
quadrupole: 20.1265 0.1402 -20.2667 -1.0182 0.0000 0.0000
hfenergy: -791.9818856 hartree
pointgroup: C01 [X(C12H12N6)]
dipole: 0.0000016 -0.0015854 0.0000026 debye
polarizability: 372.7372469|-0.0002712|66.6672868|-18.967117|0.0210607|172.9034611 unknown
InChI: InChI=1S/C12H12N6/c13-11(17-9-5-1-3-7-15-9)12(14)18-10-6-2-4-8-16-10/h1-8H,13-14H2
charge 0 multiplicity 1
30 atoms
N  1.676367 0.241061 -0.671933
N  -1.676339 0.241288 0.671772
N  3.449051 0.239614 0.993202
N  -3.449029 0.239132 -0.993356
N  0.849149 0.241207 1.605954
N  -0.849121 0.240541 -1.606116
C  0.710916 0.241865 0.253959
C  -0.710889 0.241744 -0.254121
C  3.032554 0.240324 -0.331199
C  -3.032527 0.240382 0.331042
C  3.983911 0.240773 -1.396932
C  -3.98388 0.241236 1.396779
C  5.356883 0.240479 -1.102689
C  -5.356853 0.240797 1.102542
C  5.77803 0.23974 0.252872
C  -5.778006 0.239504 -0.253017
C  4.78762 0.239365 1.255605
C  -4.7876 0.238749 -1.255754
H  3.608017 0.241183 -2.423361
H  -3.607981 0.242067 2.423206
H  6.094255 0.240836 -1.912676
H  -6.094221 0.241462 1.912532
H  6.8379 0.239374 0.523498
H  -6.837877 0.239007 -0.523638
H  5.066348 0.238682 2.315979
H  -5.066332 0.237634 -2.316126
H  1.824508 0.240162 1.957743
H  -0.018154 0.240758 2.152136
H  0.018182 0.239895 -2.152298
H  -1.82448 0.239338 -1.957905
