program: Gaussian 09
title: 000240072
version: EM64L-G09RevD.01
frameworkgroup: C1[X(C24H28O3)]
method: RPBEPBE
basis: SDD
operation: Freq
keyword: #pfreq=noraman
keyword: PBEPBE/SDD
title: #p freq=noraman PBEPBE/SDD
converged: YES YES NO NO
title: Mulliken charges:
elementType: O O O C C C C C C C C C C C C C C C C C C C C C C C C H H H H H H H H H H H H H H H H H H H H H H H H H H H H
charge: -0.231955 -0.438395 -0.434658 -0.046114 -0.427087 0.451383 0.457255 0.157622 -0.723742 -0.484755 -0.540884 -0.551096 -0.425069 -0.432194 0.332381 0.336033 -0.407420 -0.415078 0.077810 0.084034 -0.693337 -0.586045 -0.583303 -0.033120 -0.035344 -0.602559 -0.597556 0.227642 0.203662 0.208160 0.246078 0.239016 0.244975 0.257724 0.262001 0.274904 0.293419 0.253018 0.214460 0.216169 0.217241 0.211533 0.238031 0.241840 0.229270 0.242698 0.230631 0.229053 0.231263 0.356357 0.357768 0.212106 0.219333 0.215508 0.219335
chargesum: 0.00000
title: Mulliken charges with hydrogens summed into heavy atoms:
elementType: O O O C C C C C C C C C C C C C C C C C C C C C C C C
charge: -0.231955 -0.082037 -0.076891 -0.046114 0.004218 0.451383 0.457255 0.157622 -0.030489 0.017944 -0.278883 -0.276192 -0.131651 -0.179176 0.332381 0.336033 -0.192960 -0.198909 0.077810 0.084034 -0.026532 -0.114936 -0.109973 0.195933 0.195918 -0.171119 -0.162713
polarizability: 2.68143159e+02 7.90289882e+00 2.56388959e+02 1.48265663e+01 2.43807370e+01 2.78584472e+02
1716.lowfreq: -9.1296 -6.1164 -4.2829 0.0003 0.0004 0.0007 10.1346 17.5644 33.2873
frequency: 8.9659 17.3288 33.2591 34.6490 44.3647 49.6682 56.9676 59.9883 66.9784 73.1060 95.2534 119.5176 122.6621 138.4905 152.4867 166.3651 172.3947 174.9296 197.1389 210.0097 228.1901 250.8746 260.9311 268.3063 290.3634 292.9643 301.6405 328.1857 339.3772 361.2102 363.6748 368.0496 379.3844 388.0651 391.7869 432.7896 438.4464 446.1362 484.7106 490.5155 522.0162 530.0609 557.7938 565.6876 595.5611 607.7270 616.6003 647.6283 652.5896 675.6258 730.2019 731.6542 759.4667 784.3662 787.8748 792.4949 799.4809 807.8871 826.7190 842.2256 882.6745 893.7654 905.3839 916.1863 927.1322 932.3351 938.3867 943.4449 944.8036 947.8481 953.1016 956.7443 978.2064 992.9991 1015.2124 1016.2335 1029.3336 1045.3357 1068.8284 1073.1844 1083.0418 1088.8526 1099.1623 1120.6043 1121.9770 1131.5657 1158.4085 1165.8621 1166.9463 1174.2626 1204.1365 1211.9390 1221.5767 1224.8589 1239.3923 1247.7347 1250.4645 1274.8836 1281.7754 1283.7662 1290.3162 1291.9445 1314.7950 1320.9566 1322.2081 1330.1597 1372.8838 1378.7342 1393.3830 1400.3042 1409.8817 1413.8532 1426.5423 1427.7274 1428.5686 1453.8074 1454.6235 1468.1384 1469.8468 1472.3591 1479.3733 1488.8093 1494.2619 1497.3905 1597.0994 1599.4373 1607.4018 1613.7100 1615.9227 1657.8707 1659.4469 2969.0640 2972.7882 2973.5647 2980.2104 2991.4536 2993.8141 3018.6963 3018.9119 3024.4897 3027.5122 3078.7017 3080.3847 3081.4608 3086.9950 3092.0041 3093.0919 3098.4221 3100.8763 3107.1305 3109.1677 3120.8331 3124.5792 3160.8258 3189.5738 3193.3045 3195.0114 3582.0460 3583.1262
redmass: 4.6321 4.7334 5.6668 3.9264 2.5915 2.8922 2.9091 3.0499 2.3552 3.4098 2.8515 2.9256 2.6297 2.9342 3.5895 2.5020 2.4323 1.7693 1.8436 2.3605 3.5317 4.9687 3.9004 4.7604 2.3245 3.1804 4.2285 3.4472 3.5311 1.3064 1.1780 2.6820 3.1043 2.6239 3.6203 3.3948 3.0755 3.1974 2.8365 2.8926 3.4775 2.9112 2.3278 3.3987 3.6370 2.5916 4.9173 2.6418 2.4647 3.5072 3.5805 3.5705 2.1511 2.3557 2.9740 2.7079 1.5097 1.5638 1.9371 2.9573 1.6653 1.5710 2.0246 1.9748 1.5921 1.7476 1.5736 1.8403 1.3690 1.7043 1.6455 1.4411 2.7299 1.9776 1.1610 1.1726 1.7671 2.2981 2.1273 2.3202 2.3573 2.4157 2.2038 1.7830 1.7913 2.0090 1.8403 1.2171 1.2513 1.8831 1.7509 1.5432 1.4024 1.6647 1.1987 2.9491 3.0646 1.3205 1.5008 1.3485 1.3237 1.3106 1.3964 1.4173 1.3978 1.7120 5.1921 5.5162 1.2104 1.2164 2.9885 2.7038 1.2122 1.1662 1.2520 1.1426 1.1401 1.0534 1.0715 1.0427 1.0507 1.0637 2.8496 2.7530 6.9063 6.6666 8.0184 6.5110 6.6777 4.7534 4.7516 1.0589 1.0601 1.0601 1.0624 1.0369 1.0368 1.0982 1.0981 1.0975 1.0984 1.0686 1.0685 1.0986 1.1002 1.0843 1.0849 1.1001 1.0994 1.0905 1.0894 1.0908 1.0903 1.0929 1.0931 1.1143 1.1142 1.0659 1.0660
irintensity: 0.5977 0.1677 0.0821 1.8405 0.2737 0.0498 0.5344 0.3906 0.4135 0.4601 0.7239 0.3220 1.4491 0.6622 0.9150 1.1771 0.9405 0.7705 0.8060 2.8699 3.3210 2.1600 5.7089 1.1938 2.1584 6.1719 3.7153 7.6395 7.0450 84.6861 116.3303 37.2010 8.2461 3.3868 7.7975 10.6220 4.4076 0.8468 2.1368 9.6207 5.9817 5.6557 1.0438 2.1376 9.2650 19.5374 18.8395 1.3100 31.7682 1.3272 6.0679 3.3319 0.4790 8.6153 31.4038 0.6133 41.8566 22.2675 7.7593 5.7734 12.9900 10.4767 5.4192 19.4924 4.9557 11.3579 38.3770 1.3919 37.4027 47.1851 39.4859 9.2848 4.6619 35.4322 10.8262 26.7835 20.4038 18.5250 61.0962 137.7641 62.3687 43.5051 48.8876 7.0546 9.6653 24.6142 47.3469 35.6631 49.0099 57.7474 3.2027 6.2507 3.9743 16.3181 0.6055 45.6802 63.8946 22.9368 9.2581 1.9256 4.5093 4.2033 1.4908 6.0758 5.7122 24.0113 59.3928 7.4222 20.0208 20.2422 7.6784 0.8861 10.3019 10.0990 12.4529 39.4053 14.7804 10.6429 10.2147 9.9208 10.9697 5.0424 124.9019 86.1582 9.5054 9.7807 31.6083 18.3732 37.0355 17.9171 16.4668 31.6719 17.7921 14.1686 20.8290 33.5355 35.7809 6.7350 7.1505 11.4051 17.4808 21.5906 16.8174 26.8636 32.1640 6.0423 4.8505 26.4126 23.4439 28.0084 23.5414 1.4196 3.7364 9.8316 6.5836 25.0745 23.7681 40.0518 37.2324
temp: 298.150 k
press: 1.00000 atm
elementType: 8 8 8 6 6 6 6 6 6 6 6 6 6 6 6 6 6 6 6 6 6 6 6 6 6 6 6 1 1 1 1 1 1 1 1 1 1 1 1 1 1 1 1 1 1 1 1 1 1 1 1 1 1 1 1
symmnumber: 1
zpe: 1185774.0 jmol-1
zpe.correction: 0.451637 hartree
zpe.thermalcorrener: 0.480458 hartree
zpe.thermalcorrenthalpy: 0.481402 hartree
zpe.thermalcorrgfe: 0.389321 hartree
zpe.sumelectzpe: -1154.982217 hartree
zpe.sumelectthermal: -1154.953397 hartree
zpe.sumelectthermalent: -1154.952453 hartree
zpe.sumelectthermalfe: -1155.044534 hartree
dipole: -1.3694 -0.9346 -1.9545
dipole: 2.5630
quadrupole: -154.0129 -170.5496 -142.9140
quadrupole: 5.9206 14.6415 3.9714
quadrupole: 1.8126 -14.7241 12.9115 5.9206 14.6415 3.9714
hfenergy: -1155.4338547 hartree
pointgroup: C01 [X(C24H28O3)]
dipole: -0.6622208 0.2312671 0.7243915 debye
polarizability: 273.803631|-7.5914977|249.7053569|-18.4118043|18.7604763|279.6076028 unknown
InChI: InChI=1S/C24H28O3/c1-5-9-17-15-19(11-13-21(17)25)24(8-4,23(27)7-3)20-12-14-22(26)18(16-20)10-6-2/h5-6,11-16,25-26H,1-2,7-10H2,3-4H3
charge 0 multiplicity 1
55 atoms
O  -0.284992 -3.332822 -1.48242
O  4.921756 0.741425 -1.133485
O  -3.749247 2.958301 1.041523
C  -0.215012 -1.573787 0.267602
C  0.026249 -2.450711 1.56647
C  1.155344 -1.011027 -0.203466
C  -1.158837 -0.378889 0.554919
C  -0.925005 -2.560489 -0.718211
C  1.038799 -3.600231 1.400471
C  -2.454904 -2.646936 -0.652931
C  1.76389 -0.02619 0.623817
C  -1.407142 0.550656 -0.492103
C  1.846258 -1.406961 -1.373096
C  -1.801108 -0.161776 1.795048
C  3.010492 0.562627 0.329235
C  -2.261818 1.661417 -0.344856
C  3.093487 -0.827393 -1.699264
C  -2.66211 0.944315 1.979292
C  3.672707 0.142582 -0.855863
C  -2.893744 1.843015 0.917436
C  -3.018294 -3.931478 -1.285136
C  3.660693 1.606308 1.235139
C  -2.534579 2.646759 -1.478669
C  2.688018 2.382644 2.098324
C  -1.456474 2.694067 -2.541481
C  2.77706 2.52019 3.44516
C  -1.664989 2.532234 -3.872007
H  0.38678 -1.764037 2.356803
H  -0.943937 -2.858931 1.915682
H  1.127569 -4.161225 2.349055
H  0.734711 -4.306495 0.609274
H  2.037995 -3.213783 1.135953
H  -2.783083 -2.529054 0.397958
H  -2.858616 -1.751732 -1.169009
H  1.243739 0.313437 1.527429
H  -0.904706 0.410347 -1.457205
H  1.426634 -2.179854 -2.018148
H  -1.643162 -0.84227 2.63638
H  3.614735 -1.146602 -2.612031
H  -3.150321 1.100226 2.950691
H  -2.666186 -4.829185 -0.746472
H  -4.122732 -3.921111 -1.26169
H  -2.686924 -4.030528 -2.332363
H  4.228652 2.307966 0.592171
H  4.419392 1.116586 1.878252
H  -2.66289 3.65276 -1.031567
H  -3.51038 2.407726 -1.947316
H  1.867029 2.882712 1.560584
H  -0.436769 2.898073 -2.178774
H  5.285888 0.401724 -1.988154
H  -4.115781 3.017927 1.958337
H  2.059468 3.125629 4.010437
H  3.574899 2.032874 4.02025
H  -0.845416 2.608393 -4.595302
H  -2.662983 2.319582 -4.276375
