program: Gaussian 09
title: 000240036
version: EM64L-G09RevD.01
frameworkgroup: C1[X(C19H24O3)]
method: RPBEPBE
basis: SDD
operation: Freq
keyword: #pfreq=noraman
keyword: PBEPBE/SDD
title: #p freq=noraman PBEPBE/SDD
converged: YES YES NO NO
title: Mulliken charges:
elementType: O O O C C C C C C C C C C C C C C C C C C C H H H H H H H H H H H H H H H H H H H H H H H H
charge: -0.308963 -0.178129 -0.232760 0.243257 -0.197549 -0.184023 -0.126776 0.115900 0.262441 -0.526812 -0.444136 -0.542698 0.558023 -0.652004 -0.483301 0.051529 -0.511448 -0.765254 -0.783063 -0.570461 -0.578298 0.178651 0.255158 0.233236 0.229393 0.224513 0.239630 0.230023 0.218651 0.239104 0.219444 0.224481 0.239982 0.217752 0.224208 0.249385 0.250489 0.217308 0.264415 0.227060 0.233595 0.282717 0.214438 0.250076 0.235388 0.255429
chargesum: 0.00000
title: Mulliken charges with hydrogens summed into heavy atoms:
elementType: O O O C C C C C C C C C C C C C C C C C C C
charge: -0.308963 -0.178129 -0.232760 0.243257 0.057609 0.049214 0.102617 0.115900 0.262441 -0.062669 0.004539 -0.084151 0.558023 -0.187542 -0.041341 0.051529 -0.011574 -0.056471 -0.052313 -0.084997 -0.322869 0.178651
polarizability: 2.53224029e+02 5.58554035e-01 1.86816783e+02 -1.30059971e+01 3.47088220e+00 1.63280755e+02
1716.lowfreq: -12.0705 -6.8917 -0.0006 -0.0005 0.0005 6.2986 27.2830 44.7175 71.9963
frequency: 27.2381 44.6793 71.9961 107.4542 126.6358 144.3832 161.9098 182.6031 193.6038 208.7753 225.2414 238.8860 246.6397 252.6509 264.3594 279.2000 292.5701 305.3481 345.4246 367.8215 377.5110 396.2768 402.2531 447.4044 464.8248 468.6558 498.3985 521.7087 534.4187 547.1163 561.5555 574.9568 585.6753 616.4872 649.6254 667.6042 679.4347 715.9529 768.6531 774.8010 793.9573 823.5795 827.7797 846.3636 856.8021 884.0244 899.1775 903.4578 930.1203 935.3395 949.2236 959.8444 972.3298 985.9680 999.9273 1016.6291 1028.8068 1031.6024 1058.6784 1062.4739 1067.0138 1085.5755 1097.2631 1101.0353 1103.3621 1126.5331 1148.3982 1156.6437 1166.5287 1178.9379 1188.0357 1197.6492 1200.9281 1216.4768 1223.8211 1231.0163 1244.8711 1261.2138 1268.2819 1274.0013 1279.7572 1290.9348 1301.4987 1315.4006 1323.5853 1325.1523 1327.8998 1340.9751 1346.2346 1356.7630 1371.1348 1376.1632 1378.8149 1391.8083 1428.4747 1445.5158 1447.8583 1457.4580 1468.1240 1468.3693 1469.0840 1469.8937 1483.8916 1485.0914 1495.4269 1586.8972 1628.0185 1656.0395 2905.6223 2966.8113 2969.8819 2977.2566 2981.0192 2982.1184 2985.4408 2986.1187 2994.5974 2999.4677 3005.3572 3039.5329 3041.6931 3045.9017 3048.4493 3058.7648 3065.7772 3072.1108 3076.3312 3086.3329 3102.6314 3110.1472 3111.1709 3121.8157
redmass: 4.4084 5.8535 5.4330 3.1913 2.6338 4.5177 2.9766 1.3992 2.9902 2.4505 1.2984 2.4243 2.9499 2.4414 2.8160 3.1544 2.8561 3.1542 4.1293 2.7176 3.4362 3.0367 3.2375 3.3275 4.7255 3.7382 4.0387 2.8950 2.6980 2.4035 3.1023 3.5433 4.7182 3.9692 3.6410 3.2133 4.8072 3.9211 4.0202 2.2951 2.4450 2.0170 2.5537 2.4153 2.4720 1.4741 2.0018 2.2028 1.7913 1.8745 1.9215 2.2394 2.3204 2.2290 2.1461 1.9785 1.8587 1.6736 2.3549 2.5172 1.8362 2.3736 2.0405 2.1020 2.0094 1.8273 2.0703 2.3916 1.6627 1.5152 2.2810 1.3335 1.9553 1.5865 1.8994 1.5632 1.5010 1.4565 1.5887 1.6053 1.7624 1.7676 1.5734 1.9709 1.4269 1.4466 1.6604 1.5391 2.0777 1.4263 1.3260 1.2676 1.2568 1.5902 1.0787 1.0746 1.0833 1.0790 1.0867 1.0796 1.0743 1.0710 1.0777 1.0603 1.0582 9.9757 7.7811 12.0038 1.0810 1.0683 1.0751 1.0665 1.0616 1.0602 1.0373 1.0629 1.0357 1.0597 1.0662 1.0996 1.0986 1.1011 1.0980 1.0983 1.0963 1.1005 1.1002 1.0995 1.0885 1.1003 1.0992 1.0913
irintensity: 0.4789 5.1904 3.4001 1.1631 2.1791 3.3274 1.9993 0.8093 0.9333 0.5396 0.1129 0.6702 3.1683 0.7497 0.5383 1.2186 0.4589 5.1379 4.6685 1.5647 5.3973 2.8381 0.0474 4.8279 7.2677 1.3201 8.3094 2.3033 1.1887 0.5760 13.5155 3.7123 1.2624 0.6505 1.0635 7.5340 1.1883 16.4475 7.9537 8.7912 3.4597 1.4149 9.9853 8.8546 7.0082 19.7279 15.4097 8.2396 9.6267 1.6323 13.9279 5.3539 8.1054 13.6653 1.0232 44.0999 6.5893 28.2704 15.0248 16.1068 10.0079 0.4489 3.6866 2.8752 12.5386 10.0420 6.7250 2.1326 2.4363 16.5170 13.0194 1.0763 10.2359 11.2269 5.4174 21.9108 20.9722 4.2280 12.3994 2.6196 20.7857 3.0525 2.4121 1.5806 10.3703 1.4777 0.9277 5.9604 8.5481 1.8979 1.6550 31.0612 20.1113 2.6486 18.7173 23.5633 9.8188 7.6525 12.6472 5.4434 15.2090 5.8322 2.7919 4.4132 12.6215 171.4661 181.6281 180.7827 17.3675 15.2653 4.7281 30.6832 33.1981 15.4190 31.8256 12.5283 24.4870 28.5097 10.9648 12.7208 39.4346 14.4288 37.3729 11.0298 18.7490 38.0897 16.7631 30.4512 27.9966 9.3532 1.2734 9.1492
temp: 298.150 k
press: 1.00000 atm
elementType: 8 8 8 6 6 6 6 6 6 6 6 6 6 6 6 6 6 6 6 6 6 6 1 1 1 1 1 1 1 1 1 1 1 1 1 1 1 1 1 1 1 1 1 1 1 1
symmnumber: 1
zpe: 1017394.2 jmol-1
zpe.correction: 0.387505 hartree
zpe.thermalcorrener: 0.407151 hartree
zpe.thermalcorrenthalpy: 0.408095 hartree
zpe.thermalcorrgfe: 0.340950 hartree
zpe.sumelectzpe: -962.394252 hartree
zpe.sumelectthermal: -962.374606 hartree
zpe.sumelectthermalent: -962.373662 hartree
zpe.sumelectthermalfe: -962.440807 hartree
dipole: -2.0722 2.4100 2.6271
dipole: 4.1235
quadrupole: -175.0839 -124.6078 -136.7493
quadrupole: -14.4328 5.5186 2.6666
quadrupole: -29.6036 20.8725 8.7311 -14.4328 5.5186 2.6666
hfenergy: -962.7817568 hartree
pointgroup: C01 [X(C19H24O3)]
dipole: -0.7881285 0.9273051 1.0727798 debye
polarizability: 253.1662974|-0.6793751|186.4909907|-13.0867057|4.745913|163.6642793 unknown
InChI: InChI=1S/C19H24O3/c1-17-10-16-19(22-16)14(13(17)5-6-15(17)21)4-3-11-9-12(20)7-8-18(11,19)2/h9,13-14,16H,3-8,10H2,1-2H3
charge 0 multiplicity 1
46 atoms
O  -0.355532 -1.691578 1.203782
O  -4.834723 -0.774681 -1.485862
O  5.427095 0.208942 -1.593269
C  0.17499 -0.488812 0.427521
C  -0.636053 0.815977 0.699876
C  -0.53505 -1.632062 -0.293131
C  -1.950058 0.825699 -0.118495
C  1.751543 -0.457289 0.527976
C  -2.789873 -0.479276 -0.086175
C  -1.979564 -1.59099 -0.78048
C  0.137373 2.115555 0.348566
C  -2.982568 1.953999 0.157373
C  2.339165 0.930461 0.235507
C  1.603012 2.112098 0.822718
C  2.38645 -1.511309 -0.429258
C  -4.063227 -0.03225 -0.833663
C  -4.232021 1.491119 -0.643921
C  2.121802 -0.793742 2.016673
C  -3.283469 -0.903682 1.335159
C  3.921898 -1.408076 -0.52921
C  3.5115 1.104695 -0.455696
C  4.362816 -0.002935 -0.935053
H  -0.867508 0.82656 1.785418
H  0.084951 -2.370238 -0.816182
H  -1.635323 0.94102 -1.182834
H  -1.976703 -1.425046 -1.876855
H  -2.438275 -2.584501 -0.615118
H  -0.395033 2.976969 0.792751
H  0.122993 2.261923 -0.750416
H  -2.627953 2.946143 -0.169466
H  -3.205799 2.021855 1.238795
H  1.627603 2.053824 1.930777
H  2.102763 3.056087 0.540919
H  1.968539 -1.367466 -1.445011
H  2.107205 -2.527417 -0.093215
H  -4.273031 1.955685 -1.648043
H  -5.19777 1.71533 -0.156521
H  1.635025 -0.097175 2.72147
H  1.77325 -1.809926 2.259461
H  3.212384 -0.727887 2.172637
H  -3.956087 -1.775312 1.239911
H  -2.426423 -1.191178 1.963062
H  -3.848652 -0.097107 1.837243
H  4.32587 -2.131393 -1.259212
H  4.396704 -1.644294 0.444675
H  3.902366 2.11488 -0.634482
