program: Gaussian 09
title: 000239996
version: EM64L-G09RevD.01
frameworkgroup: C1[X(C14H15NO4)]
method: RPBEPBE
basis: SDD
operation: Freq
keyword: #p
keyword: freq=noraman
keyword: PBEPBE/SDD
title: #p freq=noraman PBEPBE/SDD
converged: YES YES NO NO
title: Mulliken charges:
elementType: O O O O N C C C C C C C C C C C C C C H H H H H H H H H H H H H H H
charge: -0.290672 -0.199449 -0.199479 -0.258090 -0.208288 0.329407 -0.497966 0.182235 0.182281 -0.705866 -0.700504 -0.705579 0.111172 0.110840 0.326421 -0.353899 -0.353958 -0.210996 -0.210962 0.277532 0.277629 0.228302 0.213115 0.265207 0.230613 0.230454 0.206074 0.264952 0.213026 0.228400 0.269800 0.269755 0.239257 0.239236
chargesum: 0.00000
title: Mulliken charges with hydrogens summed into heavy atoms:
elementType: O O O O N C C C C C C C C C C C C C C
charge: -0.290672 -0.199449 -0.199479 -0.258090 -0.208288 0.329407 0.057195 0.182235 0.182281 0.000758 -0.033364 0.000800 0.111172 0.110840 0.326421 -0.084099 -0.084202 0.028262 0.028273
polarizability: 1.95453605e+02 3.68803511e+01 1.38340121e+02 -4.78881898e-01 4.27599627e-01 1.66950059e+02
1716.lowfreq: -5.2728 -5.0717 0.0007 0.0007 0.0009 5.8302 8.7087 20.0815 32.4755
frequency: 2.9824 19.9822 32.4065 69.9032 96.4162 112.8862 138.2686 160.9058 168.9978 183.5069 220.8362 225.8744 241.8650 247.6270 269.9138 297.3603 318.5509 331.9324 359.9895 402.2982 412.3799 426.7347 429.2015 455.3905 522.9049 544.9773 549.5180 582.6066 615.2276 658.7174 681.9496 702.9142 716.6476 754.9154 785.6136 798.3929 802.9521 828.7262 888.7265 906.8164 916.9742 926.2817 937.6162 956.6164 974.3947 976.5545 1006.2728 1018.6684 1031.1493 1032.8287 1072.3578 1097.9302 1151.5631 1168.5659 1172.4952 1206.5619 1217.3220 1259.5201 1274.5143 1283.0427 1308.2682 1329.7335 1367.0954 1376.0879 1379.2661 1401.4100 1414.2043 1420.5087 1445.2280 1453.9531 1454.0693 1466.4044 1466.7321 1471.2507 1479.7605 1501.6763 1614.7293 1619.0215 1630.6746 1633.0433 1682.3736 2991.6669 2991.9975 2997.4470 3028.7257 3084.0167 3086.3433 3092.4394 3097.2678 3099.9261 3115.7558 3119.4474 3139.9422 3153.1583 3164.5587 3174.8489
redmass: 4.1167 4.9322 5.0455 4.4833 7.3798 2.8992 4.9270 5.4065 1.1463 5.9184 2.7096 1.0729 1.0985 4.1968 4.4183 3.6192 8.5604 2.5422 6.1067 2.8841 2.8646 3.0193 2.7853 4.8820 7.0077 3.7265 8.5679 3.8275 9.5656 4.8314 6.8929 5.4848 3.3697 4.6739 5.3239 1.7965 3.5844 4.5909 4.6047 1.3935 1.5827 1.7927 3.6050 1.2030 1.4136 5.8557 1.3467 1.9993 1.4269 1.4284 2.5694 3.0250 2.8989 1.1650 2.0262 3.1927 3.9858 3.0752 3.2070 1.4830 1.3509 1.4432 5.3783 1.2197 1.2346 1.2138 2.3448 1.5644 1.0462 2.7292 2.5413 1.0562 1.0519 1.0673 1.0524 1.0563 7.7051 7.8365 10.3664 11.9962 11.9960 1.0356 1.0363 1.0368 1.0590 1.0992 1.0992 1.1025 1.0990 1.1005 1.1002 1.0995 1.0864 1.0905 1.0956 1.1004
irintensity: 0.0354 0.6577 0.5893 2.2563 5.1122 0.1227 0.0050 4.5825 0.0786 0.1969 3.0936 0.2500 0.0501 3.6491 0.8760 8.8812 9.3588 1.7738 3.2358 4.1824 1.9818 1.3903 1.5003 0.0000 5.9794 6.0457 10.0404 0.4177 35.3746 0.0031 0.1068 19.7622 39.8771 52.8912 0.0741 22.9566 6.1537 0.3900 55.9822 0.0194 0.2615 8.4195 66.4702 0.1788 1.9023 13.5765 0.0027 0.5145 0.0800 1.6321 17.6462 26.5121 394.6894 9.0737 5.1455 35.4622 53.3280 26.2626 17.4474 0.0055 14.3617 43.0981 253.3779 44.3386 29.1369 22.5894 4.1035 39.5857 0.8154 3.1060 9.3816 4.4128 8.6405 19.4552 5.0297 27.9894 2.3541 60.7964 246.8202 381.2111 47.2075 10.3650 18.5785 21.2013 9.6922 6.5507 9.4915 0.7087 62.7239 24.0328 3.3850 14.8477 1.6394 4.9596 5.8773 20.4652
temp: 298.150 k
press: 1.00000 atm
elementType: 8 8 8 8 7 6 6 6 6 6 6 6 6 6 6 6 6 6 6 1 1 1 1 1 1 1 1 1 1 1 1 1 1 1
symmnumber: 1
zpe: 693248.4 jmol-1
zpe.correction: 0.264044 hartree
zpe.thermalcorrener: 0.282402 hartree
zpe.thermalcorrenthalpy: 0.283347 hartree
zpe.thermalcorrgfe: 0.214290 hartree
zpe.sumelectzpe: -896.792870 hartree
zpe.sumelectthermal: -896.774512 hartree
zpe.sumelectthermalent: -896.773568 hartree
zpe.sumelectthermalfe: -896.842625 hartree
dipole: 2.9187 3.8850 -0.0295
dipole: 4.8593
quadrupole: -95.8591 -107.3187 -119.2367
quadrupole: -2.5370 0.0828 -0.0828
quadrupole: 11.6124 0.1528 -11.7652 -2.5370 0.0828 -0.0828
hfenergy: -897.0569146 hartree
pointgroup: C01 [X(C14H15N1O4)]
dipole: 1.1400921 1.5313335 -0.1009703 debye
polarizability: 195.0581624|37.0917174|138.9056957|-2.6444112|2.2324974|166.7799265 unknown
InChI: InChI=1S/C14H15NO4/c1-14(2,3)19-11(16)8-15-12(17)9-6-4-5-7-10(9)13(15)18/h4-7H,8H2,1-3H3
charge 0 multiplicity 1
34 atoms
O  -1.970436 0.16636 -0.028247
O  0.521236 -1.282537 -2.269655
O  0.493354 -0.947415 2.425088
O  -3.433167 -1.668838 0.110538
N  0.239423 -1.326767 0.091275
C  -3.067869 1.240926 -0.096058
C  -1.02124 -2.049742 0.135964
C  2.080574 -0.140388 -0.69276
C  2.07253 -0.039628 0.720336
C  -3.894168 1.190713 1.203218
C  -2.238245 2.531012 -0.196904
C  -3.917184 1.005993 -1.360017
C  0.897607 -0.954653 -1.118244
C  0.884068 -0.786749 1.243336
C  -2.284992 -1.170667 0.071809
C  3.083935 0.464335 -1.463898
C  3.067671 0.669682 1.408813
C  4.095187 1.185725 -0.776875
C  4.087067 1.286924 0.63754
H  -1.065947 -2.752647 -0.714238
H  -1.073399 -2.629796 1.07388
H  -3.236709 1.287151 2.085123
H  -4.607718 2.034838 1.211262
H  -4.461801 0.250251 1.279222
H  -1.605026 2.516902 -1.100593
H  -1.586635 2.644859 0.68643
H  -2.911652 3.404927 -0.252565
H  -4.500196 0.0752 -1.282174
H  -4.617132 1.85164 -1.489258
H  -3.27257 0.953077 -2.254978
H  3.080373 0.378353 -2.554962
H  3.05185 0.739719 2.50091
H  4.895024 1.672261 -1.345312
H  4.880784 1.850079 1.139993
