program: Gaussian 09
title: 000239979
version: EM64L-G09RevD.01
frameworkgroup: C1[X(C13H11BrN2O)]
method: RPBEPBE
basis: SDD
operation: Freq
keyword: #p
keyword: freq=noraman
keyword: PBEPBE/SDD
title: #p freq=noraman PBEPBE/SDD
converged: NO YES NO NO
title: Mulliken charges:
elementType: Br O N N C C C C C C C C C C C C C H H H H H H H H H H H
charge: -0.015610 -0.226246 -0.020603 -0.003143 0.150651 0.228667 -0.144218 0.301045 -0.391723 -0.772603 0.143168 -0.345651 -0.334628 -0.226630 -0.230256 -0.785243 -0.224352 0.263125 0.307126 0.307086 0.277339 0.290024 0.231314 0.234412 0.243195 0.242863 0.268109 0.232783
chargesum: 0.00000
title: Mulliken charges with hydrogens summed into heavy atoms:
elementType: Br O N N C C C C C C C C C C C C C
charge: -0.015610 -0.226246 -0.020603 -0.003143 0.150651 0.228667 -0.144218 0.301045 -0.128598 -0.158392 0.143168 -0.068312 -0.044604 0.004684 0.004156 -0.031077 0.008431
polarizability: 3.06093512e+02 2.66812718e+01 2.01547026e+02 1.36895117e-01 -1.52757368e-01 7.15713434e+01
1716.lowfreq: -4.8051 -2.6725 -0.0003 0.0001 0.0004 4.2762 13.0576 44.5080 51.8022
frequency: 11.3954 44.4748 51.7995 65.6641 99.5939 134.7499 139.1427 164.8083 171.3263 200.5228 256.7056 264.3024 266.8207 403.7533 409.1529 409.9979 412.8139 468.7624 510.3885 557.3229 559.9246 598.4863 615.8628 640.1452 661.3240 699.5618 702.8431 731.0154 760.0848 827.9550 868.4287 870.9088 876.1653 939.3871 941.3760 964.7200 988.7296 1005.0818 1010.6794 1015.7556 1026.0451 1031.1294 1075.9698 1095.2198 1140.4074 1148.8906 1173.4180 1181.5305 1222.6689 1238.5562 1280.0735 1285.9749 1317.8696 1368.0452 1374.5350 1392.8746 1404.2871 1422.6107 1433.2986 1446.5422 1462.1615 1463.9301 1488.7686 1536.4077 1576.0904 1584.1084 1612.2047 2988.6248 3066.6674 3073.8794 3128.6478 3130.2599 3132.6854 3141.6541 3143.5492 3156.6334 3167.7922 3174.9102
redmass: 5.5869 3.8877 4.7690 9.8159 4.6839 3.7635 5.9399 1.0702 9.2343 3.6819 7.9124 6.4520 4.7314 2.9893 3.2453 4.6131 6.7956 3.2722 5.7030 5.7367 2.9917 6.1043 6.4850 2.8356 6.4000 1.8351 6.1687 6.9043 1.9627 3.3422 1.3012 1.9493 6.6760 1.4536 2.7769 1.4362 6.1636 1.3715 3.4001 1.3370 1.7893 2.1851 1.7063 2.6806 1.1257 2.1886 1.0577 1.1365 6.0239 1.7246 2.6747 5.2254 1.4249 2.2318 1.3793 6.3318 1.4299 2.1744 2.7318 1.5144 2.2872 1.0538 2.9288 5.5492 7.3744 6.2760 6.1625 1.0377 1.0586 1.0971 1.0991 1.0856 1.1048 1.0917 1.0894 1.0939 1.0959 1.0996
irintensity: 0.3551 1.4864 0.0001 0.5589 3.7342 5.9145 1.1988 0.3845 1.5515 0.3992 1.9659 2.1991 8.7114 0.6440 1.7511 0.5543 14.0051 0.0171 19.9926 11.8653 3.4418 10.2886 1.5228 2.7879 26.3481 51.3417 33.3138 4.5586 56.0669 7.2700 0.7747 7.3763 4.1244 11.6082 37.2283 3.0276 1.1186 0.0075 26.4611 0.6145 2.7919 0.8393 13.7346 1.6507 0.2139 12.5864 0.8084 45.2964 16.1363 127.4259 114.9937 192.2562 0.5683 7.4956 75.7463 5.7747 212.8604 50.9049 105.6152 47.3491 132.3667 23.1718 76.4471 467.0560 136.9728 1.2456 21.4886 2.3762 10.1434 9.5007 16.8177 0.2672 0.0983 12.5532 15.4491 16.5975 9.9307 29.1806
temp: 298.150 k
press: 1.00000 atm
elementType: 35 8 7 7 6 6 6 6 6 6 6 6 6 6 6 6 6 1 1 1 1 1 1 1 1 1 1 1
symmnumber: 1
zpe: 546758.3 jmol-1
zpe.correction: 0.208249 hartree
zpe.thermalcorrener: 0.223647 hartree
zpe.thermalcorrenthalpy: 0.224591 hartree
zpe.thermalcorrgfe: 0.162250 hartree
zpe.sumelectzpe: -698.972571 hartree
zpe.sumelectthermal: -698.957174 hartree
zpe.sumelectthermalent: -698.956230 hartree
zpe.sumelectthermalfe: -699.018571 hartree
dipole: 1.2915 -3.8386 0.0069
dipole: 4.0501
quadrupole: -99.7921 -100.1017 -110.3388
quadrupole: 11.2160 -0.0463 -0.0681
quadrupole: 3.6188 3.3092 -6.9279 11.2160 -0.0463 -0.0681
hfenergy: -699.1808207 hartree
pointgroup: C01 [X(C13H11Br1N2O1)]
dipole: -0.3280619 -1.5554051 -0.1098028 debye
polarizability: 309.9481586|-14.6505919|196.4807814|13.8386577|6.2670554|72.7829413 unknown
InChI: InChI=1S/C13H11BrN2O/c1-9(17)11-8-15-13(16-12(11)7-14)10-5-3-2-4-6-10/h2-6,8H,7H2,1H3
charge 0 multiplicity 1
28 atoms
Br 1.227363 3.688271 0.390895
O  4.377024 0.222267 0.402107
N  0.13482 0.830514 0.170984
N  -0.115351 -1.58549 0.017043
C  2.115165 -0.576173 0.21242
C  1.482142 0.722315 0.247788
C  -0.63065 -0.306327 0.058222
C  -2.096069 -0.139917 -0.021331
C  1.233102 -1.687376 0.094158
C  2.309738 1.98736 0.371396
C  3.592103 -0.771206 0.292259
C  -2.941304 -1.27803 -0.141472
C  -2.66888 1.16221 0.021617
C  -4.338077 -1.113787 -0.21758
C  -4.066559 1.318919 -0.054981
C  4.158346 -2.186656 0.237677
C  -4.904729 0.183654 -0.174672
H  1.630229 -2.707482 0.06062
H  3.016321 2.091534 -0.465245
H  2.898431 1.995727 1.300679
H  -2.481344 -2.269971 -0.173091
H  -1.999614 2.023041 0.114396
H  -4.986906 -1.991424 -0.3101
H  -4.505008 2.321991 -0.021615
H  3.886368 -2.692824 -0.706967
H  3.777004 -2.806056 1.070432
H  5.254442 -2.126197 0.309041
H  -5.991809 0.308911 -0.23398
