program: Gaussian 09
title: 000239967
version: EM64L-G09RevD.01
frameworkgroup: C1[X(C10H10N4)]
method: RPBEPBE
basis: SDD
operation: Freq
keyword: #pfreq=noraman
keyword: PBEPBE/SDD
title: #p freq=noraman PBEPBE/SDD
converged: YES YES NO NO
title: Mulliken charges:
elementType: N N N N C C C C C C C C C C H H H H H H H H H H
charge: -0.461193 -0.150592 -0.076382 -0.587940 0.436365 0.300831 -0.455068 -0.331655 -0.373129 -0.199686 -0.218262 -0.259494 0.005000 -0.246833 0.303513 0.215544 0.309033 0.221326 0.224658 0.221065 0.227223 0.239996 0.323749 0.331930
chargesum: 0.00000
title: Mulliken charges with hydrogens summed into heavy atoms:
elementType: N N N N C C C C C C C C C C
charge: -0.157680 -0.150592 -0.076382 0.067738 0.436365 0.300831 -0.239524 -0.022622 -0.151803 0.024972 0.002803 -0.032271 0.005000 -0.006837
polarizability: 2.31804433e+02 1.80049118e+00 1.53626033e+02 7.43789876e-02 -5.56578857e-02 5.33223486e+01
1716.lowfreq: -2.5114 -0.0007 -0.0003 0.0005 5.5718 6.3863 38.8807 60.1185 107.2109
frequency: 38.5688 60.1137 107.2094 166.6100 202.7237 257.8233 258.7341 303.0551 407.5644 409.1402 441.8228 464.8208 504.7537 537.3148 570.3551 577.5046 610.1599 615.5920 658.3338 677.2329 696.7989 759.8231 764.7313 769.5248 803.8033 840.5785 848.9185 912.8562 925.5847 952.7364 957.0189 969.5027 984.3846 999.5781 1026.3687 1062.8488 1093.6071 1126.3124 1169.9620 1185.8179 1223.9784 1256.6241 1309.0286 1318.0550 1336.8587 1388.0149 1428.8867 1446.4976 1470.9445 1493.8922 1494.8991 1555.6460 1570.9003 1602.5429 1613.7111 1618.7183 3104.1844 3128.9483 3134.5350 3141.8332 3161.8212 3164.1237 3197.5906 3536.5341 3563.0505 3722.5505
redmass: 3.8476 5.5064 5.0166 4.9090 5.9475 4.2015 4.1979 6.4303 2.9298 2.9434 1.7831 1.7674 2.5744 1.0410 7.1345 6.9096 1.2412 6.3851 6.8975 4.2332 1.9356 6.2119 1.7555 2.6649 2.3060 1.2789 5.4552 1.4328 6.5753 1.3911 2.5241 1.3452 6.1318 1.3038 2.1110 2.2365 1.6718 1.5604 1.0583 1.1129 3.0309 2.5272 2.0823 1.6722 2.0157 5.2276 2.6084 2.5977 3.1839 2.4478 2.9492 4.5141 3.3458 2.4202 2.3137 4.8869 1.0887 1.0865 1.0890 1.0931 1.0981 1.1000 1.0946 1.0754 1.0442 1.1058
irintensity: 0.1268 0.0000 0.1033 6.6450 6.7796 4.2261 4.2381 0.5991 8.1018 0.0230 148.9142 138.4411 35.7174 11.4930 5.8521 2.7101 33.2395 1.5012 1.4582 2.4111 45.2456 1.1479 92.0222 0.4953 95.5145 0.3341 1.3246 14.5098 15.0329 0.3746 0.1325 0.0358 2.2734 3.1068 10.5934 2.0227 10.1146 1.6342 0.0110 4.1781 7.2564 44.7967 15.5895 4.9870 34.3167 38.7509 33.2555 191.4230 88.3709 94.8526 206.6070 983.2099 86.1779 157.5078 205.6762 148.2199 16.9889 0.8289 17.4526 32.0198 20.4826 27.8064 13.1821 20.9664 97.7813 44.7360
temp: 298.150 k
press: 1.00000 atm
elementType: 7 7 7 7 6 6 6 6 6 6 6 6 6 6 1 1 1 1 1 1 1 1 1 1
symmnumber: 1
zpe: 494683.1 jmol-1
zpe.correction: 0.188415 hartree
zpe.thermalcorrener: 0.199787 hartree
zpe.thermalcorrenthalpy: 0.200732 hartree
zpe.thermalcorrgfe: 0.150375 hartree
zpe.sumelectzpe: -605.105609 hartree
zpe.sumelectthermal: -605.094236 hartree
zpe.sumelectthermalent: -605.093292 hartree
zpe.sumelectthermalfe: -605.143649 hartree
dipole: 0.9903 -0.7225 -0.0067
dipole: 1.2259
quadrupole: -81.6874 -60.5723 -88.6899
quadrupole: -4.2373 0.0400 -0.0309
quadrupole: -4.7042 16.4109 -11.7067 -4.2373 0.0400 -0.0309
hfenergy: -605.2940234 hartree
pointgroup: C01 [X(C10H10N4)]
dipole: -0.3902942 0.2832478 0.0073948 debye
dipolederiv: -2.2824389 -0.1207851 0.0083645 -0.0504705 -0.2189039 0.0041473 0.0097197 0.0057188 -0.3531175 -1.1032027 0.4675623 0.0162721 0.6618096 -0.7832998 -0.0174565 0.0197336 -0.0156052 -0.2390726 -0.6048696 -0.3560617 -0.006787 0.6282977 -1.067111 -0.0235386 0.0182257 -0.0184401 -0.2610505 -0.3040116 0.2688565 0.0048135 0.6113209 -1.4197728 -0.0192818 0.011618 -0.0148114 -0.7217034 1.3774956 0.3083691 -0.0009387 0.8303193 0.2019315 -0.0027562 0.0121362 0.0001893 0.1080145 2.360907 -0.1318583 -0.0145318 -0.549844 0.6111605 0.0130591 -0.0263255 0.0098139 0.2140973 -0.4289691 -0.1231623 -0.0027401 0.0548199 0.0713888 0.0083522 0.003436 0.0098704 -0.2233384 -0.2747766 -0.0192087 -0.0002951 -0.3691134 -0.1510278 0.0036757 -0.0095033 0.000738 -0.1726444 -1.2174432 0.0463843 0.0064938 -0.2603452 -0.2473894 0.0017829 -0.0013112 0.00003 -0.2423452 0.1669155 0.0163533 -0.0021409 -0.0799974 0.1100942 0.0084869 -0.0061746 0.0076087 -0.1394269 0.1193204 -0.0289406 -0.0036492 0.0937959 0.1738666 0.0093426 0.0006296 0.0098498 -0.1439337 -0.149005 0.0741523 0.0013541 0.0345801 -0.1325422 0.0012245 0.0005808 0.001083 -0.1965126 0.7771893 -0.2406591 -0.0091057 -0.8468285 1.8407645 0.0445546 -0.0232799 0.0410071 0.2030985 0.8808351 -0.0612071 -0.0065382 -0.5514914 0.6709165 0.0210055 -0.0190047 0.0182682 -0.0414208 0.1419446 -0.0065278 0.000907 -0.0501408 0.1093489 -0.0048899 0.0009924 -0.0054011 0.2999695 0.0785305 -0.0661348 -0.000984 -0.0296031 -0.1340075 -0.0090228 0.0002755 -0.0085965 0.1682012 0.1740375 0.06675 0.0029524 0.0910889 0.0625814 -0.0038465 0.0037641 -0.0034988 0.1675307 0.0640207 0.0819579 0.002855 0.0312109 -0.095129 -0.0079055 0.0015767 -0.0083716 0.2003282 -0.086874 0.0967965 0.005236 0.1163151 0.0197784 -0.0053083 0.0058994 -0.0050592 0.1569962 0.0741309 -0.0009756 0.0006485 -0.0475269 -0.1291448 -0.0083848 -0.0009115 -0.0085439 0.1510677 -0.1065112 -0.0880388 -0.0000846 -0.0942086 0.0440704 -0.0030303 -0.0000041 -0.0029411 0.1705652 -0.0181402 -0.1236869 -0.0023532 -0.1144959 -0.020049 -0.0030048 -0.0024365 -0.0028655 0.1217284 0.1429808 0.0059689 0.0008445 -0.0464163 0.2509177 -0.0033588 0.0001123 -0.0051595 0.3832592 0.2179344 -0.0659042 -0.0005931 -0.0630764 0.231558 -0.0038467 0.0002512 -0.0048833 0.3897095 unknown
polarizability: 231.7876279|2.0176222|153.5602793|-1.1288312|2.737578|53.4049073 unknown
InChI: InChI=1S/C10H10N4/c11-10-12-7-6-9(14-10)13-8-4-2-1-3-5-8/h1-7,13H,11H2
charge 0 multiplicity 1
24 atoms
N  -0.304421 1.159491 0.015369
N  1.325852 -0.589972 -0.037588
N  3.725249 -0.044259 -0.036151
N  2.965939 -2.256721 -0.086474
C  -1.526186 0.435617 0.005873
C  1.023046 0.740155 -0.002357
C  -2.724027 1.205941 0.04114
C  -1.612549 -0.982497 -0.037209
C  2.053559 1.73654 0.018472
C  -3.98225 0.573589 0.033986
C  -2.882055 -1.599839 -0.043919
C  -4.072076 -0.837731 -0.008789
C  2.661429 -0.916125 -0.052343
C  3.379978 1.278663 -0.000372
H  -0.417466 2.174959 0.042916
H  -2.666725 2.302433 0.074219
H  -0.690062 -1.562782 -0.064186
H  1.823773 2.805509 0.047925
H  -4.892172 1.183398 0.061572
H  -2.937852 -2.694104 -0.077156
H  -5.049839 -1.330727 -0.014399
H  4.216104 1.986474 0.013069
H  2.216742 -2.942394 -0.102915
H  3.943307 -2.534615 -0.099981
