program: Gaussian 09
title: 000239972
version: EM64L-G09RevD.01
frameworkgroup: C1[X(C11H17N5)]
method: RPBEPBE
basis: SDD
operation: Freq
keyword: #pfreq=noraman
keyword: PBEPBE/SDD
title: #p freq=noraman PBEPBE/SDD
converged: YES YES NO NO
title: Mulliken charges:
elementType: N N N N N C C C C C C C C C C C H H H H H H H H H H H H H H H H H
charge: -0.177411 -0.068548 -0.328396 -0.063378 -0.069395 -0.345951 0.157260 -0.355697 0.001923 -0.239170 -0.356208 0.007574 -0.344955 -0.677954 -0.331792 -0.680113 0.207757 0.234716 0.210658 0.234024 0.261692 0.205871 0.230507 0.227336 0.195890 0.209263 0.226345 0.214927 0.318498 0.255311 0.211654 0.206730 0.221033
chargesum: 0.00000
title: Mulliken charges with hydrogens summed into heavy atoms:
elementType: N N N N N C C C C C C C C C C C
charge: -0.177411 -0.068548 -0.009898 -0.063378 -0.069395 0.096522 0.157260 0.088985 0.001923 0.022522 0.080169 0.007574 0.078272 -0.027419 -0.076481 -0.040696
polarizability: 2.06546806e+02 -5.18671932e+00 1.69586689e+02 3.45583070e+00 9.65445212e+00 9.38760467e+01
1716.lowfreq: -0.0006 -0.0005 0.0004 0.2892 4.9195 7.3099 26.5775 32.4329 43.4327
frequency: 26.5264 32.2717 43.3605 68.8886 76.7602 83.1764 129.4160 167.0782 200.3863 212.7765 225.3526 244.7778 275.7425 289.7476 307.8874 347.6512 394.1508 442.2268 478.5173 519.4828 536.8216 565.5005 608.0273 632.5593 706.3853 719.2198 743.5204 744.0074 758.4784 787.8875 810.5561 814.7470 861.7634 877.0626 879.5381 890.7611 939.8891 944.1213 1042.4586 1043.7446 1058.2300 1086.5374 1107.3231 1112.2449 1115.0005 1134.4828 1179.9432 1203.4423 1214.3141 1258.5391 1266.6973 1277.1889 1300.2296 1303.9146 1308.7868 1315.3434 1326.8562 1343.8906 1360.6199 1364.6232 1390.5324 1392.9835 1401.4955 1424.0674 1450.1725 1455.1527 1472.0011 1475.4110 1476.1860 1478.2901 1480.1522 1484.4269 1487.5198 1528.0878 1552.1409 1588.9424 2973.6105 2977.3611 2986.4619 2993.6246 2997.8402 3006.7777 3035.8270 3040.8755 3060.1697 3065.0129 3076.6773 3077.7060 3082.1271 3083.3198 3146.9141 3222.8908 3575.7874
redmass: 3.2047 2.6518 4.0087 1.6855 1.7802 4.7307 5.4364 2.6828 5.2346 1.1481 1.1471 2.4263 2.9622 3.1756 4.8185 4.6159 6.9766 3.6351 4.4540 3.2011 1.3724 4.0566 4.3811 4.6646 8.0804 4.2837 1.3945 1.2344 3.0142 3.4701 3.9935 2.0575 1.4140 1.4136 1.6637 1.8484 1.4692 3.0238 3.3542 3.1217 2.6041 2.9019 2.1943 2.2090 2.9657 2.3915 2.1046 1.9729 2.0598 1.3785 2.2134 1.3401 1.2835 1.3946 1.3059 2.1643 1.9169 2.1224 1.3869 1.3776 1.2125 1.2090 3.4109 2.5909 1.4058 1.2161 1.0890 1.2680 1.2329 1.0566 1.0554 1.0806 1.1123 7.1848 4.4894 8.1609 1.0357 1.0362 1.0604 1.0606 1.0611 1.0595 1.0985 1.1001 1.1022 1.1027 1.1017 1.1012 1.1031 1.1002 1.0935 1.0979 1.0770
irintensity: 0.0222 0.0233 0.0392 0.0248 0.0094 0.5290 0.4017 1.3857 5.2648 0.1295 0.2308 3.8391 1.5301 0.2559 2.8200 2.6930 0.8387 5.6544 6.2245 16.4031 90.1019 11.0436 1.2806 12.2985 4.2346 4.1254 0.9084 22.1490 5.6811 28.2608 7.4796 4.6400 1.8893 5.4139 12.6004 13.4091 13.6978 13.5732 0.9027 0.9909 2.4635 2.1370 14.1625 4.7036 30.7898 6.2749 23.3053 14.5140 2.4909 6.3117 17.2075 5.6107 6.7844 6.5869 22.0418 38.2882 4.8293 33.0403 39.0849 2.5983 13.5440 18.1292 64.9191 52.8569 11.6222 10.0887 4.5204 17.1575 33.0649 12.5025 4.9103 15.1063 26.6080 31.7578 476.6247 344.8196 36.3424 34.8339 13.6790 6.8232 72.4843 56.2413 1.5535 0.2580 1.6225 4.4004 70.2000 71.5807 47.0031 44.5862 15.9268 0.2357 75.4806
temp: 298.150 k
press: 1.00000 atm
elementType: 7 7 7 7 7 6 6 6 6 6 6 6 6 6 6 6 1 1 1 1 1 1 1 1 1 1 1 1 1 1 1 1 1
symmnumber: 1
zpe: 724051.6 jmol-1
zpe.correction: 0.275777 hartree
zpe.thermalcorrener: 0.291871 hartree
zpe.thermalcorrenthalpy: 0.292815 hartree
zpe.thermalcorrgfe: 0.230221 hartree
zpe.sumelectzpe: -701.932233 hartree
zpe.sumelectthermal: -701.916139 hartree
zpe.sumelectthermalent: -701.915195 hartree
zpe.sumelectthermalfe: -701.977789 hartree
dipole: 1.6467 4.2465 0.7302
dipole: 4.6127
quadrupole: -89.1657 -98.0644 -97.5443
quadrupole: -12.0504 -1.6998 -0.1015
quadrupole: 5.7590 -3.1396 -2.6195 -12.0504 -1.6998 -0.1015
hfenergy: -702.2080101 hartree
pointgroup: C01 [X(C11H17N5)]
dipole: 0.5168332 -1.7297509 -0.1852708 debye
polarizability: 206.478355|2.4785015|170.0885368|-8.903342|4.0169473|93.4426502 unknown
InChI: InChI=1S/C11H17N5/c1-3-5-12-11-13-7-9-10(15-11)16(6-4-2)8-14-9/h7-8,12H,3-6H2,1-2H3
charge 0 multiplicity 1
33 atoms
N  -1.967204 -0.312229 -0.257333
N  0.434329 0.245467 -0.424513
N  2.600972 1.186006 -0.539506
N  -2.808351 1.778747 0.23611
N  0.859543 2.65436 -0.027976
C  -1.917227 -1.766027 -0.485301
C  -0.870396 0.54881 -0.220152
C  -1.568024 -2.561254 0.794351
C  -1.40506 1.844339 0.083478
C  -3.097423 0.484973 0.028409
C  3.235427 -0.104898 -0.82941
C  1.251753 1.348939 -0.324059
C  3.565661 -0.934699 0.436595
C  -1.509202 -4.078251 0.519019
C  -0.460979 2.89314 0.174033
C  4.22985 -2.281088 0.079087
H  -2.89809 -2.08655 -0.883129
H  -1.155274 -1.958344 -1.2627
H  -2.321309 -2.343827 1.575926
H  -0.592849 -2.205332 1.175657
H  -4.098568 0.058106 0.060771
H  4.161785 0.08791 -1.40391
H  2.551643 -0.6872 -1.473295
H  2.625079 -1.108269 0.992211
H  4.230563 -0.345743 1.098459
H  -2.480132 -4.460192 0.150607
H  -1.256444 -4.635993 1.438039
H  -0.741371 -4.316801 -0.240646
H  3.16209 2.029208 -0.417068
H  -0.751642 3.922855 0.407756
H  3.566085 -2.894073 -0.55954
H  5.178219 -2.128046 -0.470678
H  4.458945 -2.867146 0.987206
