program: Gaussian 09
title: 000239956
version: EM64L-G09RevD.01
frameworkgroup: C1[X(C7H6N4O3)]
method: RPBEPBE
basis: SDD
operation: Freq
keyword: #pfreq=noraman
keyword: PBEPBE/SDD
title: #p freq=noraman PBEPBE/SDD
converged: NO NO NO NO
title: Mulliken charges:
elementType: O O O N N N N C C C C C C C H H H H H H
charge: -0.199626 -0.212270 -0.228756 -0.401381 -0.424950 0.074910 -0.398645 0.366267 -0.086030 0.064666 0.148648 0.086921 0.160003 -0.755353 0.341298 0.348692 0.373817 0.254466 0.243673 0.243651
chargesum: 0.00000
title: Mulliken charges with hydrogens summed into heavy atoms:
elementType: O O O N N N N C C C C C C C
charge: -0.199626 -0.212270 -0.228756 -0.060084 -0.076258 0.074910 -0.024829 0.366267 -0.086030 0.064666 0.148648 0.086921 0.160003 -0.013563
polarizability: 1.90317770e+02 -1.04414058e+00 1.26139919e+02 1.14969053e-02 -7.64085688e-03 4.91600937e+01
1716.lowfreq: -10.4434 -0.0008 -0.0006 -0.0003 6.4171 7.1378 65.2027 95.5531 110.4434
frequency: 65.1816 95.5473 110.4393 154.4165 184.8860 207.5267 225.9818 285.2496 330.6926 367.8112 385.8537 413.4868 438.6113 519.0897 530.9633 560.5588 568.4173 623.0600 646.9678 674.0024 686.3553 700.4533 742.9878 752.6642 763.8900 785.9980 824.9572 968.9295 991.0939 1035.5618 1088.6447 1115.2589 1198.3456 1257.8551 1266.3311 1281.8693 1353.0104 1373.4723 1389.4625 1397.3272 1443.3324 1446.0612 1518.8177 1549.4519 1565.0786 1627.0986 1660.7569 1683.8855 2990.2750 3064.2539 3133.6867 3489.6899 3525.5495 3534.0925
redmass: 5.8628 5.8328 1.0998 6.9417 5.4370 5.3303 5.7150 4.4241 12.7294 4.4108 8.4110 9.2996 5.5006 8.8761 6.3190 6.9077 1.2204 4.4379 9.1580 4.9003 1.9248 3.2913 2.2762 5.9241 2.3394 4.4139 5.3212 3.9030 2.0371 1.5356 4.2604 6.6799 7.9274 2.1537 2.6721 7.6546 5.0653 1.7141 1.5493 1.4985 1.1721 1.0455 4.5975 5.4753 5.0756 6.7371 7.7005 5.3885 1.0381 1.0957 1.0998 1.0776 1.0771 1.0783
irintensity: 0.7919 4.7822 2.0811 0.8299 8.9079 2.5704 2.9123 9.3471 8.0677 0.0076 16.2310 23.0919 0.3903 1.7015 9.2313 0.3563 46.7945 7.2104 10.1927 11.3412 21.5641 10.9006 148.2512 6.5366 21.3611 134.6420 7.7552 26.4756 38.9614 3.9275 30.9568 5.0236 39.0596 27.0487 10.1756 9.2335 262.6422 59.1880 14.0078 43.5593 6.3776 17.0521 41.5487 138.5014 84.7367 733.2732 261.4859 656.0444 4.6477 10.6349 5.3092 40.1122 80.5974 65.2777
temp: 298.150 k
press: 1.00000 atm
elementType: 8 8 8 7 7 7 7 6 6 6 6 6 6 6 1 1 1 1 1 1
symmnumber: 1
zpe: 362440.0 jmol-1
zpe.correction: 0.138046 hartree
zpe.thermalcorrener: 0.149615 hartree
zpe.thermalcorrenthalpy: 0.150559 hartree
zpe.thermalcorrgfe: 0.100337 hartree
zpe.sumelectzpe: -714.078478 hartree
zpe.sumelectthermal: -714.066910 hartree
zpe.sumelectthermalent: -714.065966 hartree
zpe.sumelectthermalfe: -714.116188 hartree
dipole: 0.1110 -3.7895 0.0012
dipole: 3.7911
quadrupole: -95.6036 -86.2822 -78.9477
quadrupole: 4.1154 -0.0004 0.0013
quadrupole: -8.6591 0.6623 7.9968 4.1154 -0.0004 0.0013
hfenergy: -714.2165243 hartree
pointgroup: C01 [X(C7H6N4O3)]
dipole: -0.0535273 1.4905731 0.0004802 debye
dipolederiv: -0.5591962 0.1693876 0.0000375 0.251007 -1.2128362 -0.0001033 0.0000601 -0.0002007 -0.3286599 -1.1205296 0.3698291 0.0000902 0.6786328 -0.7310261 -0.0000631 0.0000711 -0.0000312 -0.360587 -1.3966251 -0.3816792 -0.0000412 -0.4570054 -0.7003628 -0.0000446 0.0001992 0.0000797 -0.3748883 -0.9247648 0.3911022 0.000055 -0.1734228 -0.3136223 -0.0000039 -0.0000237 -0.0000144 -0.2999446 -1.6354081 -0.2965139 0.0000849 -0.0019179 -0.5017682 -0.0000403 0.0000209 -0.0000006 -0.314373 0.4556755 -0.2340577 -0.0000067 0.207534 -0.1424864 -0.000042 0.0000758 0.0000604 -0.190984 -0.8041678 -0.3897144 -0.0000507 -0.5050425 -1.0463604 -0.0000288 -0.0000602 -0.0000701 -0.352858 1.0253363 0.0500075 -0.0000175 0.5726178 0.9832251 0.0000375 0.0000282 0.0000837 0.2450256 -0.7415581 0.4374807 0.0001016 -0.3677488 -0.5881167 -0.0000385 0.00001 -0.0000625 -0.0434091 0.3013647 0.277056 -0.0001047 0.9700341 -0.0686552 -0.0000698 -0.0003274 -0.0001993 0.0241588 1.5041831 -0.1074697 -0.0000715 -0.2319517 1.674209 0.0001735 -0.0001195 0.0001914 0.2560036 1.4097037 -0.4851831 -0.0001393 -0.9355318 0.6465714 0.0000954 -0.00012 0.0000772 0.2733122 2.191073 0.3438085 -0.0000456 0.1527759 1.3081466 0.0001361 -0.0002074 0.0000313 0.3306392 -0.3777279 -0.1280811 0.000104 -0.0509393 0.0143898 0.0000266 0.0007507 0.0002307 0.0309617 0.1339609 -0.0217209 0.0000047 -0.0351752 0.1904528 -0.0000136 0.0000093 -0.0000109 0.330185 0.1330662 0.0206784 0.0000072 0.0572111 0.2241296 -0.0000147 0.0000131 -0.0000102 0.346487 0.2287122 -0.0596915 0.000001 -0.0527289 0.1790895 -0.0000255 0.0000131 -0.0000256 0.3466054 0.092916 0.0613492 0.0000856 -0.0384951 -0.0649331 -0.0002652 -0.0001481 -0.00028 0.1207038 0.0419841 -0.0081938 -0.0692243 -0.0197099 0.0748455 0.071786 -0.0952626 0.0288724 -0.0189011 0.0420018 -0.0083938 0.0691298 -0.0201435 0.075108 -0.071502 0.0950175 -0.0287214 -0.0194772 unknown
polarizability: 190.328764|-0.6201111|126.1289248|-0.0115471|0.0075647|49.1600937 unknown
InChI: InChI=1S/C7H6N4O3/c1-2-5(12)9-4-3(8-2)6(13)11-7(14)10-4/h9-11H,1H3
charge 0 multiplicity 1
20 atoms
O  1.415835 -2.69977 -0.0004
O  -3.267061 1.705024 0.000347
O  3.78758 1.339006 -0.000076
N  -0.936689 1.523395 0.000283
N  1.451458 1.418727 0.000211
N  -1.127203 -1.252417 -0.000059
N  2.548339 -0.662829 -0.00014
C  0.222079 0.77752 0.000181
C  0.111218 -0.627001 0.000026
C  -2.250522 -0.535789 0.000037
C  1.338707 -1.447916 -0.000115
C  -2.255473 0.950635 0.000274
C  2.691409 0.72361 0.000123
C  -3.587857 -1.223048 0.000194
H  -0.918063 2.550067 0.000372
H  1.538835 2.438483 0.000306
H  3.419531 -1.203522 -0.000371
H  -3.441704 -2.312982 -0.001237
H  -4.183109 -0.92353 -0.882368
H  -4.181712 -0.925864 0.884513
