program: Gaussian 09
title: 000239954
version: EM64L-G09RevD.01
frameworkgroup: C1[X(C6H10N4S2)]
method: RPBEPBE
basis: SDD
operation: Freq
keyword: #p
keyword: freq=noraman
keyword: PBEPBE/SDD
title: #p freq=noraman PBEPBE/SDD
converged: NO YES NO NO
title: Mulliken charges:
elementType: S S N N N N C C C C C C H H H H H H H H H H
charge: 0.181253 0.257172 0.047425 -0.001238 -0.669951 -0.614257 0.151503 -0.313240 0.165434 -0.424111 -0.816672 -0.827733 0.305081 0.306549 0.327807 0.347275 0.241942 0.277358 0.276550 0.270828 0.270617 0.240408
chargesum: 0.00000
title: Mulliken charges with hydrogens summed into heavy atoms:
elementType: S S N N N N C C C C C C
charge: 0.181253 0.257172 0.047425 -0.001238 -0.058321 0.060825 0.151503 -0.313240 0.165434 -0.424111 -0.020822 -0.045880
polarizability: 1.72872669e+02 -1.01693602e+01 1.70299518e+02 1.70168034e-01 -1.50352436e-01 6.09823876e+01
1716.lowfreq: -90.0971 -9.6729 -5.8211 -4.8701 -0.0020 -0.0015 -0.0008 55.7415 74.0797
frequency: -90.0689 55.7090 74.0713 84.2990 101.6468 115.5989 116.6012 153.4303 185.0873 215.0035 241.9146 273.2991 304.4409 316.3420 367.6839 405.4015 504.1439 535.0475 558.3785 588.7533 636.1112 644.4021 658.7475 661.6744 664.8779 704.4819 764.8709 810.7643 948.8061 976.5258 980.2233 987.9860 993.4026 1008.4949 1149.1808 1185.9506 1233.0610 1285.6959 1331.6301 1343.9529 1346.9393 1432.2112 1432.8669 1435.8412 1445.4125 1456.4699 1503.8575 1528.1694 1589.7993 1637.4267 3020.8329 3025.0913 3143.5335 3149.8925 3151.0277 3156.5623 3445.7185 3520.3613 3556.7000 3690.9794
redmass: 1.0802 2.8663 1.3045 2.5085 2.4525 2.6680 1.6771 5.0082 3.4861 9.2015 4.4859 3.4455 4.1915 3.9487 12.4421 7.9281 1.1889 5.6570 3.6540 7.8584 1.6790 1.1046 8.4371 7.0972 7.1803 4.7278 8.9966 11.1195 5.8100 1.1781 1.1762 1.3065 1.3553 2.1091 1.3024 5.2184 5.4923 8.8015 2.2531 1.5433 1.3318 1.0572 5.5823 1.0534 1.0524 1.0633 2.1788 8.0009 1.9525 1.1694 1.0281 1.0280 1.1037 1.1042 1.1056 1.1058 1.0443 1.0445 1.0980 1.1044
irintensity: 7.0357 0.0696 4.5768 8.2439 2.9057 0.1602 0.1349 1.3109 5.3497 1.1035 0.0729 11.1930 5.9666 9.1283 2.0630 3.8230 231.1776 0.3764 34.4681 2.5243 224.1245 69.6380 18.6844 8.4765 1.2565 39.1389 14.8638 53.9116 61.8341 3.4938 12.3765 4.0487 5.9479 48.4813 2.6617 64.3920 31.2803 208.6795 121.8034 89.8562 17.6996 0.7147 169.8288 29.7860 28.2690 44.8913 135.7929 112.5083 552.1703 129.6554 21.3575 24.6590 15.0745 8.6383 15.1607 12.1912 4.5298 107.3592 11.5164 65.9962
temp: 298.150 k
press: 1.00000 atm
elementType: 16 16 7 7 7 7 6 6 6 6 6 6 1 1 1 1 1 1 1 1 1 1
symmnumber: 1
zpe: 429683.0 jmol-1
zpe.correction: 0.163658 hartree
zpe.thermalcorrener: 0.177266 hartree
zpe.thermalcorrenthalpy: 0.178210 hartree
zpe.thermalcorrgfe: 0.122776 hartree
zpe.sumelectzpe: -1248.863487 hartree
zpe.sumelectthermal: -1248.849879 hartree
zpe.sumelectthermalent: -1248.848935 hartree
zpe.sumelectthermalfe: -1248.904369 hartree
dipole: 2.6291 1.2936 0.0499
dipole: 2.9305
quadrupole: -78.1085 -74.8895 -87.4965
quadrupole: -12.2859 0.3556 -0.1900
quadrupole: 2.0563 5.2754 -7.3317 -12.2859 0.3556 -0.1900
hfenergy: -1249.027145 hartree
pointgroup: C01[X(C6H10N4S2)]
dipole: -0.6215161 -0.9661517 0.097711 debye
dipolederiv: 0.0234499 -0.0135726 -0.0086977 0.1746518 -0.7542794 0.0233098 -0.0179816 0.0349564 -0.1265878 -0.591599 -0.2484973 0.0352449 -0.392972 -0.0943673 0.0187666 0.0400687 0.0105984 -0.0866493 -0.941792 -0.4616264 0.0602402 -0.6719126 -1.4782959 0.1013632 0.0801253 0.0864338 -0.1347971 -1.5730689 0.0398385 0.0543889 0.0215043 -0.5613319 0.0152081 0.0597048 0.0159496 -0.2278829 -0.863117 0.0151426 -0.001781 0.1273477 -0.5222269 0.0420589 -0.0065305 0.0443763 -0.1609553 -1.2341477 0.6143151 -0.0036291 0.6495284 -0.6756059 -0.0273435 0.0104044 -0.0408863 -0.6829422 -0.0135053 0.3954764 -0.0128186 0.780077 -0.6725634 -0.0127843 -0.0547892 0.0026887 -0.0477738 0.629525 0.0287897 -0.0340646 -0.1185859 1.5923601 -0.0792798 -0.0094952 -0.0717161 -0.0105184 1.5624004 -0.4776547 -0.0316789 -0.7091082 1.0961149 -0.0180359 -0.0409354 -0.0377472 0.2054837 1.6776621 0.3715619 -0.0896668 0.635818 1.0715644 -0.0835856 -0.1040896 -0.0665003 0.0066371 0.1309661 -0.0879142 -0.0020357 -0.1002368 0.075634 0.0049683 -0.0039222 0.0027423 0.0559902 0.1489182 -0.0652448 -0.0015598 -0.0504387 0.0072295 0.00398 -0.001745 0.0042688 0.0452691 0.2595468 -0.0467274 0.0756887 -0.1420194 0.1473563 -0.1011106 0.0664806 -0.0576821 0.1562144 0.2759111 -0.0568928 -0.0548304 -0.1905323 0.1691587 0.0925166 -0.0208009 0.0459165 0.1107123 0.2128836 -0.0428333 0.007263 -0.0875228 0.2313894 0.0137518 0.004939 0.0173846 0.3814714 0.2894251 -0.0380686 0.0025026 -0.0007388 0.2386134 0.0072483 -0.0078539 0.0132126 0.3645567 0.0707066 0.024831 0.0023572 0.0525636 -0.1291053 0.012115 0.0009037 0.0129837 0.1258673 -0.0473973 0.0269376 -0.0653071 -0.0525738 0.1029081 -0.0823287 -0.0430812 -0.0685991 -0.0058992 -0.0327583 0.0432805 0.0650836 -0.036606 0.1159764 0.0725334 0.0516415 0.0488545 -0.0366205 0.0667685 0.0219175 -0.0311273 0.0969615 -0.0129577 -0.1131863 -0.0271229 -0.0819375 -0.0178325 0.0704126 0.0314855 0.0197518 0.1079609 0.0050649 0.1017661 0.0087245 0.0774069 -0.0400388 -0.1211905 -0.0745444 0.0146761 -0.0931658 0.0473637 0.0080686 0.0153552 0.0072957 0.1262957 unknown
polarizability: 180.9113417|-3.8913807|161.747216|-5.4863803|-4.9673922|61.4960165 unknown
InChI: InChI=1S/C6H10N4S2/c1-11-5-3(7)4(8)9-6(10-5)12-2/h7-8H2,1-2H3
charge 0 multiplicity 1
22 atoms
S  -0.28044 -2.737539 0.077506
S  2.323645 2.105767 -0.294276
N  0.892256 -0.237513 -0.11501
N  -0.338996 1.865411 -0.167597
N  -2.819072 -0.935935 0.092612
N  -2.694012 1.868705 -0.0699
C  -1.548765 -0.266876 0.005179
C  -0.292651 -0.909158 -0.020016
C  -1.518678 1.167859 -0.07886
C  0.795016 1.120669 -0.1804
C  1.569968 -3.063823 -0.017207
C  3.620223 0.744753 -0.284901
H  -3.02112 -1.585072 -0.67528
H  -3.037374 -1.342571 1.008707
H  -2.676026 2.882848 -0.136416
H  -3.560251 1.331497 -0.028979
H  1.676881 -4.15798 0.042529
H  2.074655 -2.570333 0.824496
H  1.964875 -2.679395 -0.967503
H  3.47097 0.080787 -1.14764
H  3.550622 0.168472 0.648077
H  4.589173 1.26413 -0.353119
