program: Gaussian 09
title: 000239940
version: EM64L-G09RevD.01
frameworkgroup: C1[X(C12H11BrN2O2)]
method: RPBEPBE
basis: SDD
operation: Freq
keyword: #p
keyword: freq=noraman
keyword: PBEPBE/SDD
title: #p freq=noraman PBEPBE/SDD
converged: YES YES NO NO
title: Mulliken charges:
elementType: Br O O N N C C C C C C C C C C C C H H H H H H H H H H H
charge: -0.004037 -0.223202 -0.296095 -0.415801 -0.492772 -0.456528 0.351704 0.489442 0.302377 -0.413382 -0.442496 -0.327762 -0.253172 -0.153980 -0.165648 -0.169692 -0.236986 0.278251 0.239135 0.290919 0.290200 0.261118 0.221983 0.314832 0.254890 0.247816 0.247684 0.261203
chargesum: 0.00000
title: Mulliken charges with hydrogens summed into heavy atoms:
elementType: Br O O N N C C C C C C C C C C C C
charge: -0.004037 -0.223202 -0.296095 -0.124882 -0.202571 0.060858 0.351704 0.489442 0.302377 -0.152264 -0.220513 -0.012930 0.001717 0.093836 0.082036 0.091511 -0.236986
polarizability: 2.93407629e+02 -5.18426931e+00 1.24281041e+02 -1.67096495e+01 9.14818413e+00 1.02819964e+02
1716.lowfreq: -8.9264 -2.4013 -0.8440 -0.0008 -0.0002 0.0006 13.1791 29.5507 38.9245
frequency: 12.8993 29.4303 38.7938 45.7267 69.1013 95.5874 122.4239 172.9958 192.4479 199.4058 272.8866 300.6302 303.9153 322.5774 366.1095 384.7083 409.6917 458.1895 510.0014 585.8679 594.0104 607.2047 622.0850 652.6148 686.6967 701.8077 707.1253 733.7641 762.5873 810.5837 821.2030 830.3299 848.0751 866.7801 875.8211 879.5962 934.7475 936.9340 984.1083 987.4325 997.5713 1022.8101 1048.0186 1061.2406 1092.7303 1116.7663 1133.9509 1185.5064 1186.1827 1207.2395 1222.9256 1255.5064 1268.9286 1294.3843 1340.4675 1360.9636 1368.2477 1398.1857 1467.8965 1471.0909 1482.1112 1488.8946 1505.4281 1589.1810 1589.9438 1605.2241 1642.8030 2988.4604 3050.6402 3116.1461 3163.9976 3170.5878 3194.2957 3217.6175 3233.3089 3268.9243 3527.3330 3552.7457
redmass: 6.4252 4.8279 4.9236 7.1155 7.0317 6.3793 5.7560 3.3501 9.0842 6.7912 5.2086 3.0400 4.1742 3.3815 5.1567 1.8478 2.9954 3.9292 2.6168 1.2319 3.2401 5.0982 6.4673 5.2279 6.0520 4.4737 6.0549 1.2692 4.4320 1.4186 1.3999 4.2819 1.4004 4.7565 3.0989 1.6047 2.6952 1.3601 1.3201 4.9433 2.7628 1.6351 3.2250 2.6166 4.3074 1.3715 1.5539 1.7218 1.1150 1.8571 2.0154 1.4505 2.1167 1.3808 1.4993 4.0654 2.1877 4.4914 1.1606 1.7750 2.2145 4.3530 2.4799 6.5879 6.0392 6.0308 4.2795 1.0625 1.0985 1.0901 1.0909 1.0949 1.0953 1.0933 1.0978 1.1084 1.0762 1.0776
irintensity: 0.1073 0.5655 0.4465 0.8885 10.4832 2.4110 1.0476 1.3386 1.1969 1.3521 21.8251 7.2477 1.5610 14.8891 16.1701 15.4554 0.0765 4.3766 72.6273 142.4522 5.8253 4.6133 2.6475 24.2273 10.2466 9.0543 7.0001 87.8326 10.3063 42.7141 28.1622 5.4622 56.7284 12.2443 5.6250 3.4096 5.1174 1.3031 3.3037 42.6722 8.8442 36.9463 0.2405 25.0612 12.5714 13.6627 18.8585 29.0430 4.4644 367.6106 38.5184 83.9925 20.6024 27.2660 1.1240 147.4520 5.3935 11.5611 102.9125 258.6282 18.8059 7.2977 942.2090 6.5654 43.8771 30.3987 168.6513 54.6263 7.5244 19.1972 4.5708 4.0594 11.5703 4.5986 0.3899 0.4095 5.4019 29.4687
temp: 298.150 k
press: 1.00000 atm
elementType: 35 8 8 7 7 6 6 6 6 6 6 6 6 6 6 6 6 1 1 1 1 1 1 1 1 1 1 1
symmnumber: 1
zpe: 548040.1 jmol-1
zpe.correction: 0.208737 hartree
zpe.thermalcorrener: 0.224472 hartree
zpe.thermalcorrenthalpy: 0.225417 hartree
zpe.thermalcorrgfe: 0.161283 hartree
zpe.sumelectzpe: -736.065812 hartree
zpe.sumelectthermal: -736.050077 hartree
zpe.sumelectthermalent: -736.049133 hartree
zpe.sumelectthermalfe: -736.113266 hartree
dipole: 5.1513 -3.4644 -2.8140
dipole: 6.8159
quadrupole: -97.7858 -105.1008 -105.1522
quadrupole: -6.0922 -5.7607 2.3441
quadrupole: 4.8938 -2.4212 -2.4726 -6.0922 -5.7607 2.3441
hfenergy: -736.2745497 hartree
pointgroup: C01 [X(C12H11Br1N2O2)]
dipole: -1.8974043 1.2409983 1.4320144 debye
polarizability: 290.6588514|-23.9736193|105.2594305|-13.8657193|11.5425069|124.5903524 unknown
InChI: InChI=1S/C12H11BrN2O2/c13-9-3-5-10(6-4-9)15-12(16)14-8-11-2-1-7-17-11/h1-7,14-15H,8H2
charge 0 multiplicity 1
28 atoms
Br 6.85098 -0.633445 -0.303119
O  -3.729753 -1.029002 0.614109
O  -0.156852 -0.228868 -1.680001
N  -1.479408 0.931089 -0.144546
N  0.811315 0.681787 0.277292
C  -2.723686 0.678833 -0.892651
C  -3.854162 0.230112 -0.018549
C  2.179524 0.350475 0.09212
C  -0.262719 0.413808 -0.592004
C  -5.080955 0.786064 0.313336
C  3.090109 0.74059 1.11229
C  2.669127 -0.340753 -1.049278
C  -5.761164 -0.151304 1.18531
C  4.46549 0.452984 1.003244
C  4.046807 -0.626647 -1.158708
C  -4.913359 -1.232886 1.345876
C  4.932924 -0.230199 -0.137681
H  -2.467254 -0.081371 -1.653514
H  -3.050982 1.588451 -1.432824
H  -1.546478 1.464883 0.723018
H  0.597265 1.161582 1.154001
H  -5.457458 1.748874 -0.027822
H  2.727564 1.274146 2.000306
H  1.970808 -0.646814 -1.82994
H  -6.74747 -0.034742 1.629597
H  5.155799 0.758368 1.794499
H  4.418908 -1.158159 -2.039354
H  -4.970417 -2.168052 1.895592
