program: Gaussian 09
title: 000239909
version: EM64L-G09RevD.01
frameworkgroup: C1[X(C10H13NO4S2)]
method: RPBEPBE
basis: SDD
operation: Freq
keyword: #p
keyword: freq=noraman
keyword: PBEPBE/SDD
title: #p freq=noraman PBEPBE/SDD
converged: YES YES NO NO
title: Mulliken charges:
elementType: S S O O O O N C C C C C C C C C C H H H H H H H H H H H H H
charge: 0.980429 -0.001816 -0.535991 -0.547729 -0.414823 -0.236555 -0.540804 -0.772545 -0.081155 0.521765 -0.769987 0.223980 -0.343130 -0.357504 -0.215146 -0.215795 -0.225641 0.333057 0.278650 0.310152 0.311745 0.312572 0.288115 0.249284 0.245957 0.231495 0.232735 0.233548 0.115431 0.389704
chargesum: 0.00000
title: Mulliken charges with hydrogens summed into heavy atoms:
elementType: S S O O O O N C C C C C C C C C C
charge: 0.980429 0.113615 -0.535991 -0.547729 -0.025118 -0.236555 -0.229059 -0.160838 0.228997 0.521765 -0.169300 0.223980 -0.093846 -0.111547 0.016349 0.016940 0.007907
polarizability: 2.59382698e+02 -8.99890889e+00 1.71821313e+02 -1.76311789e+00 1.18024706e+01 1.10222409e+02
1716.lowfreq: -7.0571 -3.2718 -0.0024 -0.0021 -0.0015 6.6441 11.8794 21.9200 42.7896
frequency: 11.4763 21.4372 42.7456 52.4866 68.5561 80.9104 92.3042 114.4699 119.2042 149.5924 174.8763 181.4087 190.6296 225.0387 249.7017 282.4192 305.3690 333.5691 352.3712 400.3619 402.8477 457.5723 479.0779 517.1053 526.4800 557.1608 575.5184 606.6676 615.4149 645.3933 695.6396 720.0181 772.8725 776.0701 807.3305 815.3440 819.6227 851.9357 875.0144 884.7261 934.7183 940.9887 971.4813 982.2944 989.6010 1002.5077 1026.3188 1032.6446 1047.5415 1081.8340 1105.8296 1132.3492 1176.4802 1187.9686 1191.5490 1221.2300 1237.0552 1239.4178 1278.9284 1286.5879 1292.8320 1331.5763 1376.4766 1389.1107 1431.4377 1438.9557 1445.0713 1484.5415 1588.9974 1611.0467 1667.6710 2434.4984 2974.2643 3058.3000 3062.0407 3129.6323 3135.1233 3140.8869 3144.7811 3155.9951 3157.3751 3169.8625 3296.4993 3527.5101
redmass: 6.0487 8.7180 4.1421 8.9733 6.2144 8.1233 6.4872 4.9229 5.3022 3.2760 1.8293 2.7985 6.6906 7.2173 7.2404 7.3166 5.5770 6.3147 2.1063 3.5965 4.2714 5.2740 5.3387 4.4284 4.2278 2.0899 4.2635 2.5747 6.2470 2.6990 1.7182 3.9513 1.9799 1.4795 4.1924 3.5245 3.1620 1.2512 2.2934 2.1584 1.4402 2.2310 2.0267 1.4009 5.9679 1.3404 2.1928 3.5048 2.7235 1.5663 2.1052 1.1259 1.0542 1.2419 1.1206 1.1454 2.2092 1.3471 1.2853 1.4883 1.2083 1.2734 1.5771 8.7565 1.0889 1.2362 1.9807 2.3405 5.9420 5.9657 9.1488 1.0387 1.0816 1.0575 1.0575 1.0851 1.0884 1.1081 1.0928 1.1000 1.1100 1.1018 1.0732 1.0643
irintensity: 0.5575 0.9271 0.2477 3.0503 5.8644 0.4022 5.3360 7.4128 1.3895 8.7084 59.3106 4.8419 0.2848 2.7493 1.5598 3.6959 5.5914 32.1135 0.6481 15.7138 25.7996 76.3412 12.9804 27.7390 12.4392 85.0351 11.5949 89.2012 1.0329 61.3487 50.8724 8.8971 20.9234 0.6944 38.7892 4.5573 83.2104 0.3400 46.3046 18.4184 2.1856 52.1238 18.4964 0.3072 0.4765 0.0898 4.3782 210.9378 112.8585 28.1320 25.0735 2.4329 0.0343 23.7837 3.0253 10.8849 55.9664 1.7730 30.3067 16.4675 9.6243 0.7461 31.0080 1.7842 10.5186 8.1847 11.9770 3.3570 0.6412 7.9236 241.1577 16.7865 13.9344 8.4648 7.4664 0.9623 0.2465 0.9634 14.4823 33.1959 6.5232 22.7108 68.6098 44.4052
temp: 298.150 k
press: 1.00000 atm
elementType: 16 16 8 8 8 8 7 6 6 6 6 6 6 6 6 6 6 1 1 1 1 1 1 1 1 1 1 1 1 1
symmnumber: 1
zpe: 570394.7 jmol-1
zpe.correction: 0.217252 hartree
zpe.thermalcorrener: 0.236058 hartree
zpe.thermalcorrenthalpy: 0.237002 hartree
zpe.thermalcorrgfe: 0.166810 hartree
zpe.sumelectzpe: -1539.177302 hartree
zpe.sumelectthermal: -1539.158496 hartree
zpe.sumelectthermalent: -1539.157552 hartree
zpe.sumelectthermalfe: -1539.227744 hartree
dipole: 0.0811 2.9382 -3.4029
dipole: 4.4966
quadrupole: -97.6000 -108.1264 -122.3877
quadrupole: 3.8454 -5.3763 8.4990
quadrupole: 11.7714 1.2449 -13.0163 3.8454 -5.3763 8.4990
hfenergy: -1539.3945538 hartree
pointgroup: C01 [X(C10H13N1O4S2)]
dipole: -0.2921739 1.6863105 0.4480311 debye
polarizability: 254.6739978|23.9260197|145.6987997|-1.6666615|-33.6461552|141.0536228 unknown
InChI: InChI=1S/C10H13NO4S2/c12-10(13)9(6-16)11-17(14,15)7-8-4-2-1-3-5-8/h1-5,9,11-12,16H,6-7H2
charge 0 multiplicity 1
30 atoms
S  -0.205961 -1.111128 0.059806
S  -4.934115 -2.046534 0.64947
O  -0.168178 -0.946586 -1.56406
O  0.209142 -2.5206 0.764317
O  -3.330487 1.368704 -2.068099
O  -1.65695 1.820441 -0.52744
N  -1.992417 -0.755117 0.642242
C  0.77702 0.397405 0.964422
C  -2.886936 -0.354727 -0.468468
C  2.167876 0.469601 0.455973
C  -4.350452 -0.341352 0.053881
C  -2.521818 1.042439 -0.978937
C  2.469136 1.269159 -0.680828
C  3.208682 -0.265335 1.087432
C  3.791033 1.344207 -1.1655
C  4.52944 -0.18885 0.600164
C  4.823349 0.617469 -0.52546
H  0.110799 1.229469 0.695875
H  0.660825 0.077026 2.010189
H  -2.825807 -1.032072 -1.346558
H  -2.298048 -1.684147 1.00706
H  -5.027381 -0.060817 -0.766289
H  -4.460591 0.37174 0.884986
H  1.663555 1.81999 -1.179159
H  2.975508 -0.899541 1.950453
H  4.018309 1.961545 -2.041204
H  5.327061 -0.75725 1.09038
H  5.849948 0.675533 -0.904068
H  -4.665349 -1.848238 1.994334
H  -3.073294 2.261065 -2.425217
