program: Gaussian 09
title: 000239901
version: EM64L-G09RevD.01
frameworkgroup: C1[X(C10H13NO2)]
method: RPBEPBE
basis: SDD
operation: Freq
keyword: #p
keyword: freq=noraman
keyword: PBEPBE/SDD
title: #p freq=noraman PBEPBE/SDD
converged: YES YES NO NO
title: Mulliken charges:
elementType: O O N C C C C C C C C C C H H H H H H H H H H H H H
charge: -0.435295 -0.443028 -0.077370 -0.572733 -0.500275 0.527117 0.200601 -0.397682 -0.374970 -0.384673 -0.349042 -0.756385 0.278647 0.213505 0.227228 0.243462 0.224928 0.230185 0.237674 0.216697 0.249544 0.247273 0.259925 0.217761 0.352041 0.364864
chargesum: 0.00000
title: Mulliken charges with hydrogens summed into heavy atoms:
elementType: O O N C C C C C C C C C C
charge: -0.083254 -0.078164 -0.077370 -0.132001 -0.031884 0.527117 0.200601 -0.167497 -0.137296 -0.167976 -0.099499 -0.031426 0.278647
polarizability: 1.84561416e+02 -8.50113493e+00 1.21453404e+02 1.19737294e+01 -2.79494790e+00 6.85436231e+01
1716.lowfreq: -15.5182 -0.0009 -0.0008 -0.0007 5.5985 9.3757 23.3836 37.4728 54.3950
frequency: 20.8386 37.2134 54.3174 62.5278 89.3881 143.5270 182.0017 277.3740 294.7687 314.7777 351.4656 359.5824 381.2537 407.2377 411.4648 420.7589 478.9561 517.1342 535.0258 613.0043 637.2737 717.0810 757.4340 781.7652 801.4546 810.6284 826.0864 842.9345 879.0542 930.0469 961.6886 972.6970 995.7363 1004.9784 1023.0167 1034.6166 1099.8766 1141.9528 1147.4144 1178.7108 1215.7477 1233.5472 1246.6157 1263.4286 1274.6933 1307.2493 1319.6320 1334.7955 1385.3086 1391.8535 1426.4502 1454.0166 1456.6792 1467.1606 1484.4273 1505.7588 1598.3871 1613.9570 1627.5222 2980.8296 2986.1464 2990.6758 3039.9265 3068.5945 3070.6922 3104.7235 3108.3006 3125.0747 3133.5259 3169.1340 3570.0397 3581.6974
redmass: 3.4183 4.2871 5.1222 1.5589 1.8622 3.8472 5.5319 3.2154 2.6525 6.0984 1.1069 3.5129 2.6896 2.9503 2.6465 1.5180 4.2826 3.1519 2.5056 3.9368 6.7465 3.7058 4.2028 1.2410 2.0168 2.1694 2.3095 2.4749 4.6318 1.3982 1.3668 1.5467 2.6256 2.6491 1.8606 1.7957 1.4231 1.3474 1.1881 1.1106 2.2200 1.7029 2.8987 1.3185 1.2744 1.6059 1.3007 1.5909 1.2257 5.8476 2.8201 1.0546 1.1092 1.0721 1.1029 2.7756 6.4358 6.4881 6.4807 1.0604 1.0385 1.0605 1.1000 1.0950 1.1007 1.1012 1.0872 1.0901 1.0962 1.0952 1.0674 1.0660
irintensity: 0.2225 0.0997 0.0852 0.6044 0.1282 0.0418 0.2990 0.2292 3.5587 1.9794 147.9545 0.1070 16.1100 12.0032 11.7330 105.2887 34.7482 42.6017 10.6988 16.4701 0.8015 0.2535 19.6680 2.9364 36.6117 19.2025 12.2687 26.7002 104.9509 0.8296 0.1731 0.7285 1.6676 8.7982 41.9151 3.3416 14.0598 266.7554 9.8012 5.9076 1.4402 67.0795 25.4207 9.1076 0.5610 10.6381 13.0340 0.5420 37.1806 14.8541 11.5040 14.8967 4.6715 16.6955 9.1658 103.4909 9.6400 5.0203 27.4759 2.5739 11.6462 48.6819 6.4933 9.2620 26.8819 18.7343 18.6447 19.0012 14.9041 6.2387 44.2557 38.0109
temp: 298.150 k
press: 1.00000 atm
elementType: 8 8 7 6 6 6 6 6 6 6 6 6 6 1 1 1 1 1 1 1 1 1 1 1 1 1
symmnumber: 1
zpe: 550483.5 jmol-1
zpe.correction: 0.209668 hartree
zpe.thermalcorrener: 0.223193 hartree
zpe.thermalcorrenthalpy: 0.224137 hartree
zpe.thermalcorrgfe: 0.167538 hartree
zpe.sumelectzpe: -593.033997 hartree
zpe.sumelectthermal: -593.020472 hartree
zpe.sumelectthermalent: -593.019528 hartree
zpe.sumelectthermalfe: -593.076127 hartree
dipole: -0.3438 2.1935 -0.1177
dipole: 2.2234
quadrupole: -74.1620 -69.5791 -80.4285
quadrupole: -10.4273 3.0726 -2.5302
quadrupole: 0.5612 5.1441 -5.7053 -10.4273 3.0726 -2.5302
hfenergy: -593.2436648 hartree
pointgroup: C01 [X(C10H13N1O2)]
dipole: 0.1281959 0.8648745 -0.0270921 debye
dipolederiv: -1.5524917 0.0497898 -0.1965124 0.0839111 -0.0646655 0.0334271 -0.2419944 0.0296687 -0.4693855 -1.43409 -0.3585807 -0.0045363 0.1398276 -0.032727 -0.0871236 -0.2462887 -0.1772991 -0.361957 0.7612972 0.3743686 0.0473662 -0.048925 -0.3331837 0.0461778 0.2127814 0.1080724 -0.214688 -0.0135479 -0.01996 0.0030304 -0.0112991 0.1634158 -0.0064018 0.0218663 -0.0159296 0.1302901 -0.1266128 0.0227142 -0.0025158 -0.0341476 0.0565292 0.0418616 -0.0214715 0.0661596 0.0746662 0.2532861 -0.0198035 0.0287635 -0.0013353 -0.1961083 0.0032368 0.0839705 0.0061383 -0.1056372 0.3266332 -0.1014101 0.0528412 -0.1395957 0.2862095 -0.1114264 0.1801947 -0.1227065 -0.0176743 0.0162426 0.0987042 0.0569482 -0.0535266 0.1191603 -0.0037991 0.0398233 0.0372367 -0.128728 0.0287323 -0.0688815 0.0521176 0.0454369 0.1339574 0.0283257 0.0475215 -0.0071633 -0.1299678 -0.3190115 -0.0298922 -0.0122056 0.3165017 0.0041034 0.0639378 -0.0145278 0.0009518 -0.1974035 -0.3001003 0.0399253 -0.0146379 -0.2616815 0.0525478 -0.0343486 -0.0429197 0.020379 -0.1706076 -0.1145192 0.1514907 -0.0608798 0.1472144 -0.1378656 0.0948216 -0.0316943 0.1254351 0.039967 1.433237 -0.0264836 0.2660364 -0.049957 0.0397591 -0.0072319 0.2998514 -0.0078653 0.1255061 0.0271209 0.0215688 -0.019854 0.0730095 -0.1033111 0.111903 -0.0376945 0.0537972 0.0211871 -0.0003669 -0.0189682 -0.034927 -0.0466783 -0.0201441 -0.1188308 -0.035945 -0.064963 -0.0284704 0.069798 0.045704 -0.0028992 0.0750824 -0.0591421 0.0893331 -0.0245988 0.0441683 0.0428329 0.0057539 -0.062362 -0.0311588 -0.0398888 -0.0220104 -0.1246371 -0.0416079 -0.0743527 -0.0140799 0.0469979 0.1021502 -0.0264437 0.0974679 -0.0639523 0.0072112 -0.0226447 0.0119488 0.1341746 0.0353705 -0.1028472 -0.0382431 -0.098336 -0.032322 -0.0256059 -0.0359204 -0.0283944 0.1277839 -0.0390009 -0.1088867 -0.0457707 -0.1046508 -0.037358 -0.0295359 -0.0549983 -0.0325068 0.1606248 0.0466695 0.0719813 -0.0189829 0.08 -0.0265014 0.0034506 -0.0258685 0.0038812 0.1661079 0.1289432 0.0009309 -0.0245414 -0.0197015 0.0566954 -0.0311688 -0.0341233 0.0264402 -0.0854507 -0.0320775 0.0675431 0.0767955 0.0065406 0.0796595 0.0101299 0.0833808 -0.0419109 0.0720769 0.0077464 -0.1411273 -0.0338863 -0.1320619 -0.0334944 -0.0073434 -0.039332 -0.0280543 0.0913767 0.4090421 -0.0019435 -0.0014292 -0.0483384 0.0482619 -0.0292191 0.0028831 -0.0175497 0.3818389 0.3349479 0.0142755 -0.0144745 0.0251312 0.1224866 0.0828562 -0.0206433 0.0844183 0.3556167 unknown
polarizability: 184.5253571|9.9720103|121.7037487|10.5926395|-1.639844|68.3293375 unknown
InChI: InChI=1S/C10H13NO2/c1-8(11-13)2-3-9-4-6-10(12)7-5-9/h4-7,12-13H,2-3H2,1H3
charge 0 multiplicity 1
26 atoms
O  4.913381 -0.229234 0.465466
O  -5.179719 -0.748192 0.178952
N  -3.749275 -0.970828 0.494195
C  -0.719379 0.210324 -0.724739
C  -1.572712 0.026319 0.571911
C  0.772213 0.122046 -0.439943
C  -3.06249 0.137839 0.309821
C  1.546141 1.285721 -0.207859
C  1.423575 -1.137978 -0.358226
C  2.923703 1.20469 0.096312
C  2.795849 -1.240172 -0.057162
C  -3.657057 1.452102 -0.14625
C  3.546153 -0.063818 0.171806
H  -0.960335 1.188484 -1.183238
H  -1.021836 -0.570034 -1.44853
H  -1.355022 -0.96128 1.016154
H  -1.268499 0.797776 1.307383
H  1.070211 2.272176 -0.270613
H  0.84808 -2.054117 -0.539763
H  3.505372 2.120228 0.267749
H  3.300024 -2.209397 0.000402
H  -3.90682 1.416265 -1.223948
H  -4.604011 1.65136 0.385083
H  -2.952836 2.283099 0.024566
H  5.350296 0.647075 0.606528
H  -5.571809 -1.633052 0.393844
