program: Gaussian 09
title: 000249994
version: EM64L-G09RevD.01
frameworkgroup: C1[X(C14H11NO5)]
method: RPBEPBE
basis: SDD
operation: Freq
keyword: #p
keyword: freq=noraman
keyword: PBEPBE/SDD
title: #p freq=noraman PBEPBE/SDD
converged: NO YES NO NO
title: Mulliken charges:
elementType: O O O O O N C C C C C C C C C C C C C C H H H H H H H H H H H
charge: -0.363509 -0.409314 -0.423277 -0.222693 -0.335963 -0.459832 0.557646 0.106649 -0.591998 0.194886 -0.365185 -0.313771 0.421810 0.220816 0.167451 -0.351796 -0.352350 -0.196704 -0.196621 -0.237210 0.256721 0.302584 0.271154 0.344878 0.248900 0.248843 0.232081 0.232146 0.232898 0.389782 0.390981
chargesum: 0.00000
title: Mulliken charges with hydrogens summed into heavy atoms:
elementType: O O O O O N C C C C C C C C C C C C C C
charge: -0.363509 -0.019532 -0.032296 -0.222693 -0.335963 -0.114955 0.557646 0.106649 -0.335278 0.194886 -0.062602 -0.042617 0.421810 0.220816 0.167451 -0.102897 -0.103507 0.035376 0.035525 -0.004311
polarizability: 3.22083009e+02 -9.71056533e+00 1.43196409e+02 7.63669044e-02 2.25638894e-01 1.11316844e+02
1716.lowfreq: -34.3400 -3.0524 -0.0010 -0.0009 -0.0005 6.1992 13.0780 22.6969 45.0179
frequency: -34.3396 22.6686 45.0048 46.5252 68.5868 111.8106 124.8321 136.5873 185.8017 219.8468 236.8495 269.5507 293.4687 309.2000 362.8639 385.2995 408.4033 432.9653 451.4803 480.7375 509.0056 543.0018 568.2687 569.2126 610.2981 619.4144 628.7507 660.7289 677.3626 682.7635 693.1438 708.1392 722.8907 742.8688 751.5042 780.7920 833.9640 836.2355 846.0369 853.0909 873.3804 906.3930 921.5193 968.6579 980.6560 990.8659 992.6693 993.8951 1019.1237 1023.2819 1074.4772 1122.0750 1134.1881 1161.0156 1172.1672 1177.2662 1182.5655 1207.1531 1236.7626 1303.9260 1309.6380 1323.5045 1372.3793 1384.4705 1405.0524 1441.0297 1453.5335 1470.8340 1494.5055 1506.0871 1584.7512 1587.7962 1602.9369 1606.4798 1655.5687 1693.2557 3019.6817 3134.4381 3144.5289 3152.5632 3157.8311 3167.2844 3169.0160 3176.3121 3201.2691 3532.0780 3534.9425
redmass: 4.3297 6.5792 6.4874 7.7449 8.1349 7.3644 6.9463 7.4194 7.8249 6.3145 5.6711 6.5313 5.1819 7.1990 7.4572 6.2238 2.8584 10.6924 2.8117 3.6996 6.0271 6.4480 1.2379 6.5164 6.4611 2.9888 5.6953 2.5409 5.5932 3.4690 1.8149 2.4085 4.8640 6.8406 3.3151 1.9895 1.2471 6.4885 1.1554 1.4234 1.6656 3.1370 1.9147 1.3781 4.1710 5.5391 1.3095 1.3365 2.0867 5.0796 1.4988 2.3229 2.5344 1.6411 1.0561 1.4500 1.6688 1.7781 1.6985 1.3236 2.0815 2.2053 3.8020 10.1492 6.3497 2.2099 2.8012 2.2454 2.4077 3.1217 3.8006 5.6276 6.0037 6.9213 5.1454 8.9056 1.0688 1.0851 1.0891 1.0925 1.0932 1.0970 1.0904 1.1014 1.0957 1.0642 1.0762
irintensity: 0.0778 0.0813 0.2950 1.6455 2.9509 0.0160 5.6021 2.7846 0.4791 0.2506 1.4431 7.5756 0.2026 1.0023 23.8817 2.4953 0.0134 10.7816 27.3361 10.9256 16.7206 19.9118 116.6822 3.2800 0.0610 0.0848 18.4119 10.2693 0.3372 59.1089 38.5476 51.6214 15.1772 0.5671 0.2680 74.4642 0.1123 12.7453 198.6126 22.2593 38.8752 103.1686 61.1112 0.0803 179.1798 4.3685 0.4815 1.2461 67.3005 394.3937 11.5123 98.9184 969.2047 56.1731 0.0488 67.9501 93.9178 13.9517 35.2342 0.1169 214.3664 11.3711 604.4806 0.9803 33.8331 4.5218 139.3494 186.9210 149.0565 457.1308 194.7370 54.0058 2.7045 5.9654 642.4223 179.2051 293.9498 0.4259 7.9371 4.4976 28.9821 15.6580 1.3857 7.0356 4.4171 88.1601 36.7663
temp: 298.150 k
press: 1.00000 atm
elementType: 8 8 8 8 8 7 6 6 6 6 6 6 6 6 6 6 6 6 6 6 1 1 1 1 1 1 1 1 1 1 1
symmnumber: 1
zpe: 593071.2 jmol-1
zpe.correction: 0.225889 hartree
zpe.thermalcorrener: 0.241997 hartree
zpe.thermalcorrenthalpy: 0.242941 hartree
zpe.thermalcorrgfe: 0.180595 hartree
zpe.sumelectzpe: -969.589315 hartree
zpe.sumelectthermal: -969.573206 hartree
zpe.sumelectthermalent: -969.572262 hartree
zpe.sumelectthermalfe: -969.634609 hartree
dipole: 2.1810 -0.3339 0.0042
dipole: 2.2064
quadrupole: -98.0400 -117.2734 -109.6788
quadrupole: 12.6682 -0.0278 0.1096
quadrupole: 10.2907 -8.9427 -1.3480 12.6682 -0.0278 0.1096
hfenergy: -969.8152036 hartree
pointgroup: C01 [X(C14H11N1O5)]
dipole: 0.8581647 -0.1300632 0.0142547 debye
polarizability: 322.086991|-9.4583626|143.1261702|2.1441376|-1.2996572|111.3831001 unknown
InChI: InChI=1S/C14H11NO5/c16-12-8-9(6-7-11(12)13(17)18)15-14(19)20-10-4-2-1-3-5-10/h1-8,15-17H
charge 0 multiplicity 1
31 atoms
O  2.473068 0.924252 -0.051464
O  -4.40963 2.051591 -0.153497
O  -5.585906 -2.033514 0.041441
O  1.463053 -1.219889 0.049317
O  -6.220603 0.191179 -0.075184
N  0.226113 0.808017 -0.060806
C  -1.121818 0.379622 -0.048699
C  -3.862249 -0.352526 -0.031863
C  -2.115139 1.384852 -0.104233
C  -3.480756 1.03461 -0.096991
C  -1.485409 -1.001733 0.015712
C  -2.84164 -1.342025 0.023197
C  3.795424 0.367982 -0.010215
C  1.369971 0.022465 -0.013785
C  -5.282586 -0.678838 -0.025142
C  4.445964 0.06564 -1.221501
C  4.427917 0.209237 1.237409
C  5.775654 -0.410658 -1.177011
C  5.757749 -0.267695 1.268798
C  6.432362 -0.577682 0.064715
H  -1.855889 2.447526 -0.154232
H  -0.708729 -1.766274 0.057754
H  -3.14148 -2.392791 0.072517
H  0.402195 1.814646 -0.109779
H  3.920665 0.201348 -2.171958
H  3.888396 0.454812 2.1574
H  6.295348 -0.651141 -2.110592
H  6.263365 -0.396779 2.23168
H  7.463007 -0.946996 0.093702
H  -5.341118 1.633289 -0.1398
H  -6.574603 -2.142323 0.04081
